program: Orca
programVersion: 5.0.2
elementType: Cl Cl O O O N N N C C C C C C C C C C C C C C C C C C C H H H H H H H H H H H H H H H H H H
charge: 1
multiplicity: 1
keywords: wb97x-d3
keywords: def2-TZVPP
keywords: def2/J RIJCOSX
keywords: DEFGRID2
keywords: scfconv7
keywords: smallprint printgap noloewdin
keywords: NOSOSCF
formula: C19H18Cl2N3O3
InChI: InChI=1/C19H18Cl2N3O3/c1-13-9-25-19(27-13,10-24-12-22-11-23-24)17-7-6-16(8-18(17)21)26-15-4-2-14(20)3-5-15/h2-8,11-13,22H,9-10H2,1H3
45 atoms
Cl -2.451291 0.259969 -2.930154
Cl 7.062267 0.88864 1.72464
O  -3.619018 -1.695642 -0.964348
O  -2.900135 -1.583339 1.170119
O  2.364008 0.269459 -1.716892
N  -3.198097 1.266303 1.132213
N  -3.48303 1.142398 2.44148
N  -1.942865 2.648362 2.120321
C  -2.947338 -0.884065 -0.038826
C  -3.852478 -2.978851 -0.372539
C  -3.795548 0.392561 0.143944
C  -3.858598 -2.63011 1.103721
C  -1.527463 -0.565758 -0.48414
C  -2.785222 -3.979083 -0.765992
C  -1.222464 -0.05804 -1.748169
C  -0.456686 -0.761277 0.383128
C  0.075018 0.231055 -2.129152
C  0.853846 -0.491002 0.026445
C  1.117656 0.006701 -1.240571
C  -2.260903 2.165482 0.928229
C  -2.71199 1.999407 3.028598
C  3.42859 0.401382 -0.857212
C  4.540527 -0.392111 -1.084626
C  3.424606 1.346452 0.158715
C  5.668437 -0.238751 -0.292681
C  4.545531 1.491552 0.959489
C  5.659478 0.698978 0.726734
H  -4.832506 -3.318679 -0.710376
H  -4.793774 0.133364 0.493289
H  -3.895455 0.952308 -0.782749
H  -4.841956 -2.285628 1.438954
H  -3.529639 -3.443107 1.749871
H  -1.803084 -3.708729 -0.374466
H  -2.710479 -4.063004 -1.850341
H  -3.041374 -4.964325 -0.375389
H  -0.637467 -1.150086 1.374488
H  0.283259 0.620186 -3.117114
H  1.644172 -0.681987 0.738959
H  -1.848441 2.468351 -0.020905
H  -2.677906 2.187993 4.087931
H  4.534786 -1.122808 -1.88287
H  2.559357 1.973726 0.330869
H  6.539704 -0.853284 -0.472579
H  4.546304 2.225555 1.753525
H  -1.257049 3.372654 2.305327
elementType: Cl O N C H
totalener: -2045.14233788 hartree
nucrepener: 2778.93815475 hartree
electener: -4824.08049263 hartree
oneelecener: -8304.27281470 hartree
twoeener: 3480.19232207 hartree
cpcmener: -0.12324245 hartree
kineticenergy: 2039.00782184 hartree
xcener: -150.066713794050 hartree
chargesum: 1.0000000
charge: -0.075824 -0.097914 -0.396701 -0.397958 -0.325343 0.143866 -0.295363 -0.087214 0.529196 0.200130 -0.155222 0.002043 -0.156205 -0.306402 0.071389 -0.120662 -0.238185 -0.210181 0.318439 0.176786 0.153752 0.294896 -0.241206 -0.211743 -0.111830 -0.124250 0.068498 0.094723 0.138031 0.159256 0.095942 0.106265 0.093642 0.092534 0.098934 0.147082 0.127851 0.156584 0.221184 0.200533 0.151276 0.163588 0.148643 0.147795 0.249345
qa: -0.0758 -0.0979 -0.3967 -0.3980 -0.3253 0.1439 -0.2954 -0.0872 0.5292 0.2001 -0.1552 0.0020 -0.1562 -0.3064 0.0714 -0.1207 -0.2382 -0.2102 0.3184 0.1768 0.1538 0.2949 -0.2412 -0.2117 -0.1118 -0.1243 0.0685 0.0947 0.1380 0.1593 0.0959 0.1063 0.0936 0.0925 0.0989 0.1471 0.1279 0.1566 0.2212 0.2005 0.1513 0.1636 0.1486 0.1478 0.2493
va: 1.2452 1.2048 1.9935 1.9634 2.0872 3.4306 2.9129 3.5625 3.9687 3.8726 3.8793 3.9820 3.5248 3.9640 3.9385 3.8721 4.1426 3.9775 3.7708 3.9215 3.9460 3.6688 4.0506 3.9832 3.9451 3.9528 3.8422 0.9982 1.0149 1.0129 1.0009 0.9940 0.9985 1.0094 1.0084 1.0272 1.0282 0.9988 0.9653 0.9776 1.0041 0.9939 1.0014 1.0027 0.9636
dispersion: -0.025735832 hartree
energy: -2045.168073715174 hartree
dipole: -21.33338 17.14104 -4.19233 -12.51835 15.77828 3.25992 6.06268 -2.92044 3.14223
magnitude: 6.17061 au
magnitude: 15.68443 debye
