program: Orca
programVersion: 5.0.2
elementType: Cl Cl O O O N N N C C C C C C C C C C C C C C C C C C C H H H H H H H H H H H H H H H H H H
charge: 1
multiplicity: 1
keywords: wb97x-d3
keywords: def2-TZVPP
keywords: def2/J RIJCOSX
keywords: DEFGRID2
keywords: scfconv7
keywords: smallprint printgap noloewdin
keywords: NOSOSCF
formula: C19H18Cl2N3O3
InChI: InChI=1/C19H18Cl2N3O3/c1-13-9-25-19(27-13,10-24-12-22-11-23-24)17-7-6-16(8-18(17)21)26-15-4-2-14(20)3-5-15/h2-8,11-13,22H,9-10H2,1H3
45 atoms
Cl -2.444865 0.279272 -2.942993
Cl 6.826161 1.110368 2.04143
O  -3.673354 -1.650489 -1.010362
O  -2.998371 -1.616083 1.137248
O  2.357627 0.271148 -1.652413
N  -3.104382 1.230198 1.188146
N  -3.362875 1.065907 2.49834
N  -1.785606 2.537052 2.194752
C  -2.980941 -0.891987 -0.057534
C  -4.083888 -2.892305 -0.422895
C  -3.753072 0.416657 0.180749
C  -3.182901 -2.980882 0.793189
C  -1.551083 -0.615906 -0.512321
C  -3.923889 -4.021772 -1.407937
C  -1.228313 -0.080269 -1.760132
C  -0.492756 -0.83597 0.363795
C  0.07396 0.221453 -2.114814
C  0.822735 -0.557755 0.032461
C  1.102432 -0.020032 -1.214487
C  -2.145697 2.108718 0.993913
C  -2.552476 1.877107 3.097227
C  3.372658 0.458444 -0.743145
C  3.289181 1.442532 0.231937
C  4.509303 -0.321735 -0.869942
C  4.355498 1.641486 1.093255
C  5.582551 -0.116096 -0.015919
C  5.493652 0.859482 0.963408
H  -5.131547 -2.810336 -0.113553
H  -4.763114 0.200697 0.524393
H  -3.81964 1.007322 -0.72955
H  -3.640177 -3.496006 1.635974
H  -2.22742 -3.463023 0.55543
H  -4.549108 -3.875012 -2.288295
H  -4.231164 -4.957479 -0.940032
H  -2.886836 -4.12652 -1.728738
H  -0.691931 -1.244844 1.344221
H  0.295685 0.641268 -3.087222
H  1.604324 -0.765234 0.750327
H  -1.746163 2.433505 0.046424
H  -2.486827 2.02305 4.16187
H  2.403857 2.058813 0.323857
H  4.565462 -1.084167 -1.635908
H  4.295525 2.407343 1.854337
H  6.472895 -0.721372 -0.115713
H  -1.07549 3.235053 2.389185
elementType: Cl O N C H
totalener: -2045.14340062 hartree
nucrepener: 2777.50202649 hartree
electener: -4822.64542711 hartree
oneelecener: -8301.14667281 hartree
twoeener: 3478.50124570 hartree
cpcmener: -0.12454788 hartree
kineticenergy: 2039.00880021 hartree
xcener: -150.066108606149 hartree
chargesum: 1.0000000
charge: -0.076570 -0.097753 -0.397593 -0.402892 -0.328070 0.135294 -0.292139 -0.085164 0.642506 0.165840 -0.138827 -0.008495 -0.210649 -0.280930 0.018348 -0.079519 -0.223687 -0.217713 0.299901 0.177214 0.154288 0.274146 -0.192186 -0.232576 -0.131406 -0.116100 0.073759 0.077043 0.138575 0.153259 0.117053 0.091309 0.097784 0.096910 0.082550 0.149935 0.128711 0.156297 0.221007 0.200178 0.163493 0.151665 0.147865 0.147592 0.249748
qa: -0.0766 -0.0978 -0.3976 -0.4029 -0.3281 0.1353 -0.2921 -0.0852 0.6425 0.1658 -0.1388 -0.0085 -0.2106 -0.2809 0.0183 -0.0795 -0.2237 -0.2177 0.2999 0.1772 0.1543 0.2741 -0.1922 -0.2326 -0.1314 -0.1161 0.0738 0.0770 0.1386 0.1533 0.1171 0.0913 0.0978 0.0969 0.0825 0.1499 0.1287 0.1563 0.2210 0.2002 0.1635 0.1517 0.1479 0.1476 0.2497
va: 1.2446 1.2048 1.9983 1.9780 2.0809 3.4382 2.9137 3.5606 3.7899 3.8980 3.8672 3.9452 3.6533 3.9629 4.0014 3.8150 4.1342 3.9850 3.7805 3.9211 3.9481 3.6913 3.9770 4.0432 3.9601 3.9489 3.8375 1.0032 1.0199 1.0144 0.9984 0.9998 1.0030 1.0054 1.0079 1.0230 1.0272 0.9994 0.9655 0.9780 0.9933 1.0035 1.0027 1.0018 0.9634
dispersion: -0.025413640 hartree
energy: -2045.168814258070 hartree
dipole: -22.00390 18.42918 -3.57471 -13.80760 16.76578 2.95818 3.54577 -0.49371 3.05205
magnitude: 5.55378 au
magnitude: 14.11658 debye
