program: Orca
programVersion: 5.0.2
elementType: Cl Cl O O O N N N C C C C C C C C C C C C C C C C C C C H H H H H H H H H H H H H H H H H H
charge: 1
multiplicity: 1
keywords: wb97x-d3
keywords: def2-TZVPP
keywords: def2/J RIJCOSX
keywords: DEFGRID2
keywords: scfconv7
keywords: smallprint printgap noloewdin
keywords: NOSOSCF
formula: C19H18Cl2N3O3
InChI: InChI=1/C19H18Cl2N3O3/c1-13-9-25-19(27-13,10-24-12-22-11-23-24)17-7-6-16(8-18(17)21)26-15-4-2-14(20)3-5-15/h2-8,11-13,22H,9-10H2,1H3
45 atoms
Cl -1.946783 1.435554 -2.27175
Cl 7.846628 -0.41699 1.382118
O  -3.355611 -0.587502 -0.631247
O  -2.562416 -1.190044 1.35243
O  2.84621 0.343987 -1.571097
N  -4.358304 1.076745 1.294894
N  -4.817135 0.622087 2.474443
N  -6.459634 1.033214 1.104236
C  -2.473877 -0.195869 0.375186
C  -3.402872 -2.016475 -0.663452
C  -2.946183 1.125508 0.987318
C  -2.756453 -2.419764 0.670083
C  -1.046782 -0.036162 -0.141518
C  -2.69373 -2.582037 -1.873016
C  -0.730085 0.661857 -1.307531
C  0.016159 -0.5896 0.563638
C  0.573181 0.794215 -1.750028
C  1.330354 -0.489743 0.13646
C  1.605401 0.209048 -1.029355
C  -5.340216 1.318075 0.456062
C  -6.103851 0.605682 2.340765
C  3.977707 0.145972 -0.818166
C  4.196658 0.8324 0.367904
C  4.939735 -0.709528 -1.329317
C  5.388231 0.651293 1.051646
C  6.13827 -0.880218 -0.65414
C  6.351589 -0.201385 0.534047
H  -4.457633 -2.297062 -0.689195
H  -2.78455 1.957906 0.306578
H  -2.399624 1.334082 1.90443
H  -3.399357 -3.053717 1.279037
H  -1.804034 -2.936826 0.514919
H  -3.14516 -2.227408 -2.799395
H  -2.770998 -3.670171 -1.864575
H  -1.634362 -2.322193 -1.878931
H  -0.178342 -1.130884 1.478871
H  0.793451 1.34291 -2.656238
H  2.112139 -0.961325 0.715623
H  -5.256189 1.69337 -0.55061
H  -6.809053 0.305915 3.096734
H  3.452379 1.51183 0.762962
H  4.761984 -1.236491 -2.257456
H  5.561808 1.184729 1.976048
H  6.891696 -1.543599 -1.055739
H  -7.399539 1.125356 0.734688
elementType: Cl O N C H
totalener: -2045.14362427 hartree
nucrepener: 2727.49221896 hartree
electener: -4772.63584323 hartree
oneelecener: -8203.14180874 hartree
twoeener: 3430.50596551 hartree
cpcmener: -0.11718914 hartree
kineticenergy: 2039.02224416 hartree
xcener: -150.070232199247 hartree
chargesum: 1.0000000
charge: -0.078968 -0.098284 -0.394396 -0.392270 -0.325395 0.141596 -0.302764 -0.092082 0.617985 0.214624 -0.121925 -0.035486 -0.193385 -0.304903 0.022462 -0.115436 -0.235540 -0.233091 0.308574 0.188632 0.152637 0.303543 -0.217901 -0.249155 -0.120003 -0.108861 0.064932 0.089879 0.161241 0.147626 0.111183 0.100300 0.092059 0.106418 0.086393 0.151956 0.126857 0.158123 0.214452 0.200633 0.163436 0.151036 0.147967 0.147281 0.248018
qa: -0.0790 -0.0983 -0.3944 -0.3923 -0.3254 0.1416 -0.3028 -0.0921 0.6180 0.2146 -0.1219 -0.0355 -0.1934 -0.3049 0.0225 -0.1154 -0.2355 -0.2331 0.3086 0.1886 0.1526 0.3035 -0.2179 -0.2492 -0.1200 -0.1089 0.0649 0.0899 0.1612 0.1476 0.1112 0.1003 0.0921 0.1064 0.0864 0.1520 0.1269 0.1581 0.2145 0.2006 0.1634 0.1510 0.1480 0.1473 0.2480
va: 1.2393 1.2046 1.9729 1.9876 2.0866 3.4340 2.9148 3.5690 3.8348 3.8184 3.7504 3.9356 3.5985 3.9843 3.9534 3.9378 4.1251 3.9816 3.7860 3.9243 3.9464 3.6620 3.9818 4.0538 3.9485 3.9446 3.8435 1.0012 1.0094 1.0200 1.0012 0.9976 1.0082 1.0073 0.9957 1.0181 1.0291 0.9988 0.9775 0.9775 0.9930 1.0047 1.0023 1.0016 0.9645
dispersion: -0.025086152 hartree
energy: -2045.168710425198 hartree
dipole: -25.61101 15.22336 -10.38765 -11.44887 12.39191 0.94304 0.38795 0.80556 1.19351
magnitude: 10.49843 au
magnitude: 26.68490 debye
