program: Orca
programVersion: 5.0.2
elementType: Cl Cl O N N N C C C C C C C C C C C C C C C H H H H H H H H H H H H H H H H H H
charge: 1
multiplicity: 1
keywords: wb97x-d3
keywords: def2-TZVPP
keywords: def2/J RIJCOSX
keywords: DEFGRID2
keywords: scfconv7
keywords: smallprint printgap noloewdin
keywords: NOSOSCF
formula: C15H18Cl2N3O
InChI: InChI=1/C15H18Cl2N3O/c1-15(2,3)14(21)13(20-9-18-8-19-20)6-10-4-5-11(16)7-12(10)17/h4-9,14,19,21H,1-3H3
39 atoms
Cl -1.401554 2.169656 -1.46924
Cl -5.458354 -0.712799 0.526689
O  2.108914 -1.966725 1.204538
N  2.628387 0.721775 0.55638
N  3.67632 0.167212 1.179155
N  4.334915 2.075992 0.375582
C  1.670984 -1.762031 -1.240212
C  1.300031 -1.363022 0.210907
C  0.712356 -1.045331 -2.190978
C  1.452466 -3.274235 -1.372064
C  3.115258 -1.442402 -1.62537
C  1.337079 0.116505 0.500433
C  0.290784 0.920511 0.671878
C  -1.114671 0.491024 0.622916
C  3.063709 1.885503 0.077825
C  -1.993673 1.030466 -0.312459
C  -1.624193 -0.422905 1.541906
C  4.693042 0.995414 1.052686
C  -3.329227 0.66913 -0.357564
C  -2.955059 -0.800701 1.522324
C  -3.795521 -0.250502 0.567843
H  0.25938 -1.673703 0.343922
H  0.847135 0.037176 -2.176561
H  0.884311 -1.378069 -3.215857
H  -0.331955 -1.257607 -1.949726
H  2.195418 -3.860351 -0.82484
H  1.537618 -3.572967 -2.417815
H  0.460756 -3.574045 -1.02499
H  3.302355 -0.372613 -1.731438
H  3.337235 -1.887854 -2.596999
H  3.838161 -1.855163 -0.919413
H  0.461564 1.975349 0.864775
H  2.123366 -2.922757 1.078326
H  2.42932 2.54884 -0.489782
H  -0.967215 -0.839652 2.294734
H  5.66982 0.781765 1.457012
H  -3.989953 1.095402 -1.099943
H  -3.328588 -1.510639 2.247197
H  3.589713 -0.771291 1.577761
elementType: Cl O N C H
totalener: -1742.23787227 hartree
nucrepener: 2002.40549621 hartree
electener: -3744.64336847 hartree
oneelecener: -6343.83174752 hartree
twoeener: 2599.18837905 hartree
cpcmener: -0.09569351 hartree
kineticenergy: 1737.21961116 hartree
xcener: -122.761589869863 hartree
chargesum: 1.0000000
charge: -0.066364 -0.072930 -0.407019 0.083203 -0.036365 -0.349491 0.305758 0.073393 -0.375434 -0.348030 -0.379689 -0.026159 -0.035362 0.014800 0.175298 0.013798 -0.138308 0.204486 -0.149994 -0.170243 0.112427 0.132322 0.091396 0.112252 0.107488 0.098179 0.100707 0.111368 0.102181 0.113088 0.102575 0.164515 0.237531 0.194078 0.164184 0.203394 0.130763 0.148503 0.257698
qa: -0.0664 -0.0729 -0.4070 0.0832 -0.0364 -0.3495 0.3058 0.0734 -0.3754 -0.3480 -0.3797 -0.0262 -0.0354 0.0148 0.1753 0.0138 -0.1383 0.2045 -0.1500 -0.1702 0.1124 0.1323 0.0914 0.1123 0.1075 0.0982 0.1007 0.1114 0.1022 0.1131 0.1026 0.1645 0.2375 0.1941 0.1642 0.2034 0.1308 0.1485 0.2577
va: 1.2592 1.2300 2.0036 3.4717 3.4424 3.0543 3.6197 4.0227 3.9613 3.9414 3.9578 3.7402 3.8694 3.5880 3.9846 3.9340 3.8719 3.9424 4.0727 4.0250 3.8887 1.0123 1.0043 1.0088 1.0006 1.0063 1.0052 0.9989 0.9969 1.0068 1.0128 0.9955 1.0082 0.9830 0.9965 0.9733 1.0201 1.0042 1.0023
dispersion: -0.023762231 hartree
energy: -1742.261634496086 hartree
dipole: 30.41097 -25.58032 4.83065 -19.45728 18.47831 -0.97897 -6.88068 8.32098 1.44030
magnitude: 5.13498 au
magnitude: 13.05209 debye
