program: Orca
programVersion: 5.0.2
elementType: Cl Cl O N N N C C C C C C C C C C C C C C C H H H H H H H H H H H H H H H H H H
charge: 1
multiplicity: 1
keywords: wb97x-d3
keywords: def2-TZVPP
keywords: def2/J RIJCOSX
keywords: DEFGRID2
keywords: scfconv7
keywords: smallprint printgap noloewdin
keywords: NOSOSCF
formula: C15H18Cl2N3O
InChI: InChI=1/C15H18Cl2N3O/c1-15(2,3)14(21)13(20-9-18-8-19-20)6-10-4-5-11(16)7-12(10)17/h4-9,14,18,21H,1-3H3
39 atoms
Cl 1.416253 -2.093857 -1.549358
Cl 5.452783 0.666106 0.63524
O  -2.150977 2.005175 1.239172
N  -2.653492 -0.680164 0.581199
N  -2.890916 -1.86472 -0.012123
N  -4.680316 -1.143167 0.990903
C  -1.639982 1.836098 -1.186616
C  -1.311898 1.411881 0.269424
C  -0.604767 1.207513 -2.120336
C  -1.506836 3.362647 -1.264742
C  -3.046207 1.441281 -1.637951
C  -1.350493 -0.073577 0.509473
C  -0.30711 -0.897467 0.584957
C  1.099258 -0.476925 0.581881
C  -3.729531 -0.233528 1.195881
C  1.994386 -1.003131 -0.3473
C  1.597421 0.400779 1.543201
C  -4.125941 -2.136404 0.245386
C  3.333768 -0.656153 -0.343517
C  2.932135 0.758166 1.569242
C  3.79463 0.228347 0.619487
H  -0.272192 1.712682 0.435414
H  0.414637 1.476032 -1.835951
H  -0.667278 0.119193 -2.140882
H  -0.7583 1.558669 -3.140864
H  -2.301609 3.890369 -0.731364
H  -1.575342 3.690804 -2.301771
H  -0.543155 3.710143 -0.88494
H  -3.261252 1.893609 -2.606717
H  -3.818102 1.794984 -0.951101
H  -3.156885 0.36445 -1.777695
H  -0.488057 -1.966151 0.644438
H  -2.084337 2.96218 1.171834
H  -3.811534 0.683962 1.752474
H  0.929901 0.79163 2.300977
H  -4.64982 -3.018444 -0.084112
H  4.007419 -1.069985 -1.08048
H  3.303817 1.432184 2.327711
H  -5.629814 -1.091472 1.332128
totalener: -1742.15218077 hartree
nucrepener: 1999.51547876 hartree
electener: -3741.66765953 hartree
oneelecener: -6340.58787065 hartree
twoeener: 2598.92021112 hartree
kineticenergy: 1737.27234756 hartree
xcener: -122.768304289480 hartree
chargesum: 1.0000000
charge: -0.030669 -0.018342 -0.378206 0.124106 -0.234560 -0.112670 0.241986 0.054239 -0.343197 -0.337030 -0.348832 -0.030226 -0.026028 0.003595 0.152830 0.001076 -0.153210 0.150837 -0.130698 -0.140752 0.088640 0.131961 0.106534 0.094589 0.115305 0.089880 0.107765 0.121285 0.122190 0.094335 0.086731 0.142760 0.203219 0.228141 0.152093 0.190681 0.131670 0.138582 0.209387
qa: -0.0307 -0.0183 -0.3782 0.1241 -0.2346 -0.1127 0.2420 0.0542 -0.3432 -0.3370 -0.3488 -0.0302 -0.0260 0.0036 0.1528 0.0011 -0.1532 0.1508 -0.1307 -0.1408 0.0886 0.1320 0.1065 0.0946 0.1153 0.0899 0.1078 0.1213 0.1222 0.0943 0.0867 0.1428 0.2032 0.2281 0.1521 0.1907 0.1317 0.1386 0.2094
va: 1.3032 1.2878 2.0211 3.5448 2.8571 3.5389 3.6819 3.9886 3.9622 3.9395 3.9277 3.6680 3.9408 3.5766 3.8716 4.0122 3.8789 3.9169 4.0392 4.0391 4.0195 1.0111 1.0025 1.0076 1.0127 1.0084 1.0112 0.9970 1.0149 1.0128 1.0026 1.0203 1.0422 0.9980 0.9999 0.9798 1.0190 1.0099 0.9913
dispersion: -0.023264473 hartree
energy: -1742.175445238132 hartree
dipole: -32.46170 26.66631 -5.79539 19.21222 -19.35536 -0.14314 -6.03431 7.31917 1.28487
magnitude: 5.93784 au
magnitude: 15.09278 debye
