program: Orca
programVersion: 5.0.2
elementType: Cl Cl O N N N C C C C C C C C C C C C C C C H H H H H H H H H H H H H H H H H H
charge: 1
multiplicity: 1
keywords: wb97x-d3
keywords: def2-TZVPP
keywords: def2/J RIJCOSX
keywords: DEFGRID2
keywords: scfconv7
keywords: smallprint printgap noloewdin
keywords: NOSOSCF
formula: C15H18Cl2N3O
InChI: InChI=1/C15H18Cl2N3O/c1-15(2,3)14(21)13(20-9-18-8-19-20)6-10-4-5-11(16)7-12(10)17/h4-9,14,18,21H,1-3H3
39 atoms
Cl 1.446122 -2.057044 -1.541341
Cl 5.468845 0.693201 0.691505
O  -2.096373 2.02218 1.236338
N  -2.640575 -0.676278 0.554691
N  -2.883777 -1.814184 -0.127057
N  -4.647589 -1.186972 0.974224
C  -1.661512 1.829321 -1.20109
C  -1.294549 1.414803 0.249386
C  -0.704879 1.126901 -2.163983
C  -1.444799 3.343003 -1.315296
C  -3.105309 1.512245 -1.588234
C  -1.342556 -0.068121 0.504295
C  -0.300575 -0.887514 0.614448
C  1.10804 -0.465224 0.612848
C  -3.706661 -0.289973 1.228131
C  2.01029 -0.973159 -0.31874
C  1.601609 0.407784 1.580284
C  -4.112437 -2.111574 0.141249
C  3.350988 -0.626705 -0.308539
C  2.935894 0.772384 1.614917
C  3.799422 0.249324 0.665858
H  -0.247766 1.710052 0.378138
H  0.339846 1.328203 -1.915431
H  -0.846054 0.045267 -2.170557
H  -0.870925 1.481338 -3.182735
H  -2.180738 3.921129 -0.751268
H  -1.540635 3.65539 -2.356374
H  -0.448602 3.63766 -0.976375
H  -3.336835 1.981448 -2.546769
H  -3.824992 1.899381 -0.86463
H  -3.285339 0.444328 -1.720661
H  -0.479578 -1.953187 0.719426
H  -2.006788 2.979469 1.174521
H  -3.801872 0.568765 1.869047
H  0.927857 0.801437 2.330694
H  -4.648633 -2.965417 -0.238157
H  4.028903 -1.030865 -1.047688
H  3.293367 1.449152 2.378594
H  -5.590399 -1.174551 1.348424
elementType: Cl O N C H
totalener: -1742.24737348 hartree
nucrepener: 1998.42772335 hartree
electener: -3740.67509683 hartree
oneelecener: -6338.30343536 hartree
twoeener: 2597.62833853 hartree
cpcmener: -0.09879336 hartree
kineticenergy: 1737.22430236 hartree
xcener: -122.758123087276 hartree
chargesum: 1.0000000
charge: -0.067104 -0.075311 -0.409228 0.134493 -0.282386 -0.085817 0.282863 0.083493 -0.377572 -0.350250 -0.366389 -0.030054 -0.030873 0.025541 0.203795 0.009862 -0.143154 0.158817 -0.145331 -0.169051 0.109586 0.124502 0.105415 0.090139 0.110755 0.097732 0.099417 0.110673 0.111846 0.102081 0.095005 0.149338 0.227346 0.215229 0.162254 0.199685 0.129175 0.148112 0.245367
qa: -0.0671 -0.0753 -0.4092 0.1345 -0.2824 -0.0858 0.2829 0.0835 -0.3776 -0.3502 -0.3664 -0.0301 -0.0309 0.0255 0.2038 0.0099 -0.1432 0.1588 -0.1453 -0.1691 0.1096 0.1245 0.1054 0.0901 0.1108 0.0977 0.0994 0.1107 0.1118 0.1021 0.0950 0.1493 0.2273 0.2152 0.1623 0.1997 0.1292 0.1481 0.2454
va: 1.2581 1.2276 1.9989 3.5221 2.8713 3.5641 3.6563 4.0268 3.9623 3.9359 3.9399 3.7251 3.8803 3.5878 3.8730 3.9377 3.8721 3.9338 4.0687 4.0243 3.8871 1.0093 1.0009 1.0063 1.0088 1.0072 1.0056 0.9988 1.0069 1.0156 1.0023 1.0172 1.0153 0.9938 0.9976 0.9768 1.0208 1.0041 0.9665
dispersion: -0.023342553 hartree
energy: -1742.270716033187 hartree
dipole: -32.80606 25.45660 -7.34946 18.83710 -19.04066 -0.20356 -6.17384 8.15496 1.98112
magnitude: 7.61452 au
magnitude: 19.35457 debye
