program: Gaussian 09
title: 000071242
version: EM64L-G09RevD.01
frameworkgroup: C1[X(C18H24N2O)]
method: RPBEPBE
basis: SDD
operation: Freq
keyword: #p
keyword: freq=noraman
keyword: PBEPBE/SDD
title: #p freq=noraman PBEPBE/SDD
converged: YES YES NO NO
title: Mulliken charges:
elementType: O N N C C C C C C C C C C C C C C C C C C H H H H H H H H H H H H H H H H H H H H H H H H
charge: -0.287135 -0.143984 -0.090767 -0.458436 -0.370098 -0.067303 -0.343157 -0.358576 -0.189705 -0.346406 -0.694971 -0.131346 0.394272 -0.406734 -0.388962 -0.159900 -0.193555 -0.217022 -0.226769 -0.242048 -0.332139 0.213719 0.220413 0.182920 0.208417 0.178811 0.191080 0.189708 0.197165 0.194167 0.249443 0.194908 0.217624 0.216774 0.210033 0.211002 0.233086 0.271562 0.226266 0.259672 0.257454 0.223969 0.224699 0.226760 0.255089
chargesum: 0.00000
title: Mulliken charges with hydrogens summed into heavy atoms:
elementType: O N N C C C C C C C C C C C C C C C C C C
charge: -0.287135 -0.143984 -0.090767 -0.024304 0.021238 0.111508 0.037630 0.032756 0.059738 0.066126 -0.057162 0.101740 0.394272 -0.135172 -0.162696 0.099772 0.063898 0.006947 -0.002069 -0.015288 -0.077050
polarizability: 2.37916665e+02 2.35004031e+01 2.50750149e+02 -6.36051387e+00 -1.72912930e+01 1.51444139e+02
1716.lowfreq: -6.3303 -1.9540 -0.0003 0.0001 0.0004 3.9748 6.1579 20.0923 21.4221
frequency: 5.6028 20.0516 21.4143 22.0151 35.4882 38.8143 55.0970 87.5154 93.4613 106.2707 114.6010 123.2513 138.3183 164.3376 202.5502 211.0818 228.1486 246.9098 300.9468 317.0771 324.7814 358.1895 401.7954 418.9317 462.4544 496.7529 511.2614 548.0788 602.6697 616.1539 625.6413 648.9161 702.1120 721.2037 725.0785 738.7119 747.7069 755.3646 774.6021 808.3035 829.9514 842.6261 849.4757 856.6934 875.3278 889.7750 909.2711 911.4303 936.3017 950.4980 979.3873 989.6349 993.9108 997.2123 1004.2117 1012.8989 1014.9738 1020.2750 1028.7854 1057.4068 1059.4791 1076.1512 1082.5116 1099.3239 1102.5489 1129.0869 1142.1206 1171.0713 1183.6404 1188.5300 1200.2536 1207.2661 1214.7866 1231.3897 1235.7347 1253.1301 1268.2973 1279.0254 1283.3799 1285.4086 1290.6126 1306.6385 1314.7408 1319.2011 1347.1777 1356.9996 1359.0299 1362.5904 1374.1892 1389.3628 1390.9936 1438.4297 1442.4347 1463.9379 1463.9799 1471.6786 1472.2626 1477.2937 1480.9569 1485.5281 1486.2664 1488.0233 1594.7139 1617.9464 1677.2252 2900.7761 2911.1281 2952.8415 2957.3953 2967.7980 2969.3711 2972.7119 2986.1897 2991.6177 3008.7455 3030.1254 3052.9742 3069.1291 3072.1840 3110.1531 3116.0685 3125.3640 3131.8677 3139.3720 3157.8953 3174.6358 3226.1452 3246.2708 3255.9084
redmass: 3.7958 5.5770 4.6365 3.6686 1.7267 3.5272 3.0029 3.1332 3.5267 4.0311 2.6345 2.3501 2.8097 4.2141 3.1260 4.1005 1.1244 2.5025 3.4967 4.2405 4.2643 4.3651 2.8402 3.4655 2.8111 3.7664 3.9021 3.2386 3.9410 6.0276 3.6621 3.0353 2.3125 1.2915 1.0708 1.3748 2.7773 1.4011 1.5267 4.0271 1.3442 1.7061 1.6003 1.2505 6.2779 1.8881 1.5016 3.4285 1.4447 1.1081 1.3781 5.9716 1.4124 1.8594 2.3808 3.1727 3.7451 2.0902 2.2621 2.7596 2.0169 2.4545 1.6162 2.1453 1.7144 2.4628 2.1144 1.0544 1.1121 1.7918 1.1061 1.7637 2.3904 1.4927 1.2800 1.3547 1.5781 1.2489 1.4791 1.1059 1.1466 1.3939 1.6154 1.4318 1.5062 1.6908 3.0252 2.0810 1.5499 1.2187 3.7583 2.1537 3.2549 1.0801 1.0691 1.0749 1.1123 1.0428 1.0772 2.2285 4.2436 1.0900 6.1827 6.0541 6.2591 1.0640 1.0828 1.0597 1.0601 1.0597 1.0948 1.0362 1.0597 1.0967 1.1005 1.1038 1.1035 1.1007 1.0993 1.0876 1.0934 1.0867 1.0890 1.0930 1.0984 1.0963 1.0910 1.0975 1.1098
irintensity: 0.1702 0.3978 0.4866 1.0867 0.0117 0.1082 0.4810 2.7279 1.1848 0.8523 3.9438 2.1461 3.2952 0.3516 2.6693 2.2049 0.0116 1.7543 1.8669 4.0728 3.6411 1.1457 0.2115 0.8198 7.8550 8.0148 6.4738 2.5400 0.6096 0.1467 3.6820 20.7512 26.1943 28.0134 11.1530 82.7673 15.4786 2.1163 60.0914 1.6975 4.6282 1.6849 3.5123 0.0896 6.7389 10.8925 2.8533 25.3211 1.7968 83.5192 0.0717 0.0400 1.5354 15.1905 44.5570 57.1118 130.9661 13.6343 5.1664 32.9433 9.4746 4.0254 20.9003 22.8901 27.5584 0.3814 32.0184 0.5322 3.0603 2.2156 13.3765 10.0130 2.1106 64.6943 4.4864 1.9218 66.1756 17.2093 6.2074 2.0348 4.5698 16.2513 3.7624 2.6907 7.5767 2.1766 3.5315 1.4538 18.8647 11.9017 2.8320 12.9617 86.2348 1.4374 0.7319 3.2392 20.6330 12.4477 2.9955 16.4150 44.0403 21.0834 1.6940 11.1322 123.0120 28.3846 55.9266 0.8483 10.5467 76.8223 31.7291 38.0138 43.0443 2.3668 0.5934 27.7801 65.3203 94.4095 50.9523 10.3007 7.7161 0.9051 18.7167 33.2812 35.1525 7.4953 1.4509 1.1439 3.0763
temp: 298.150 k
press: 1.00000 atm
elementType: 8 7 7 6 6 6 6 6 6 6 6 6 6 6 6 6 6 6 6 6 6 1 1 1 1 1 1 1 1 1 1 1 1 1 1 1 1 1 1 1 1 1 1 1 1
symmnumber: 1
zpe: 996272.3 jmol-1
zpe.correction: 0.379460 hartree
zpe.thermalcorrener: 0.401362 hartree
zpe.thermalcorrenthalpy: 0.402306 hartree
zpe.thermalcorrgfe: 0.321591 hartree
zpe.sumelectzpe: -883.422554 hartree
zpe.sumelectthermal: -883.400652 hartree
zpe.sumelectthermalent: -883.399708 hartree
zpe.sumelectthermalfe: -883.480423 hartree
dipole: 0.0983 -1.8307 -3.2161
dipole: 3.7019
quadrupole: -127.7808 -139.0379 -125.9441
quadrupole: -9.0762 -5.4107 -15.1440
quadrupole: 3.1401 -8.1169 4.9768 -9.0762 -5.4107 -15.1440
hfenergy: -883.8020142 hartree
pointgroup: C01 [X(C18H24N2O1)]
dipole: 0.0235735 -0.6784055 -1.2885863 debye
polarizability: 237.9266345|23.5912093|251.6443414|-6.5208776|-14.2189148|150.539977 unknown
InChI: InChI=1S/C18H24N2O/c1-2-3-5-10-18(11-13-20-14-12-19-16-20)21-15-17-8-6-4-7-9-17/h4,6-9,11-14,16,18H,2-3,5,10,15H2,1H3
charge 0 multiplicity 1
45 atoms
O  -0.977473 -0.962361 0.059646
N  1.796209 2.896845 -0.004884
N  2.449563 4.563645 1.398428
C  1.215576 -1.937375 0.112192
C  2.68393 -1.948768 -0.366589
C  0.424022 -0.70007 -0.354134
C  3.444566 -3.217461 0.079988
C  4.917442 -3.2404 -0.388087
C  0.92706 0.591151 0.252786
C  -1.942599 -0.005128 -0.490274
C  5.67159 -4.511303 0.058963
C  1.314052 1.65509 -0.496718
C  -3.35331 -0.457823 -0.150678
C  -3.617207 -1.762969 0.328931
C  -4.433352 0.441705 -0.338934
C  2.203149 3.979927 -0.81342
C  1.968748 3.310782 1.325623
C  -4.944085 -2.162946 0.61091
C  -5.758672 0.040389 -0.062461
C  -6.01895 -1.266277 0.413937
C  2.59836 4.9869 0.061466
H  1.173962 -1.988129 1.218203
H  0.686696 -2.832508 -0.268564
H  2.712456 -1.878872 -1.474768
H  3.211004 -1.051428 0.01556
H  0.464425 -0.628135 -1.467159
H  3.412219 -3.295393 1.186919
H  2.922598 -4.116434 -0.309464
H  5.438261 -2.342973 0.00398
H  4.949804 -3.15968 -1.49407
H  0.946592 0.620291 1.35057
H  -1.813395 0.050856 -1.596858
H  -1.756454 1.012014 -0.084971
H  6.719955 -4.504559 -0.291728
H  5.186861 -5.421635 -0.341643
H  5.685255 -4.597306 1.16192
H  1.280042 1.603359 -1.591486
H  -2.777946 -2.446197 0.485282
H  -4.238943 1.46045 -0.699294
H  2.172859 3.926761 -1.898812
H  1.734472 2.681047 2.178983
H  -5.137677 -3.174608 0.985879
H  -6.584421 0.74531 -0.211812
H  -7.046363 -1.578354 0.6329
H  2.97652 5.978372 -0.174556
