program: Orca
programVersion: 5.0.2
elementType: Cl Cl O N N N C C C C C C C C C C C C C C C H H H H H H H H H H H H H H H H H H
charge: 1
multiplicity: 1
keywords: wb97x-d3
keywords: def2-TZVPP
keywords: def2/J RIJCOSX
keywords: DEFGRID2
keywords: scfconv7
keywords: smallprint printgap noloewdin
keywords: NOSOSCF
formula: C15H18Cl2N3O
InChI: InChI=1/C15H18Cl2N3O/c1-15(2,3)14(21)13(20-9-18-8-19-20)6-10-4-5-11(16)7-12(10)17/h4-9,14,19,21H,1-3H3
39 atoms
Cl 1.017166 1.659432 -1.517383
Cl 5.507439 -0.435806 0.458796
O  -3.318993 0.473032 -1.399964
N  -1.206671 0.797545 0.396857
N  -1.818619 1.958489 0.128659
N  -0.551066 2.279247 1.86795
C  -3.672282 -1.326148 0.271817
C  -2.777474 -0.709342 -0.830928
C  -3.00376 -2.603228 0.780527
C  -5.01426 -1.700273 -0.371422
C  -3.932089 -0.378549 1.444057
C  -1.368093 -0.359224 -0.419136
C  -0.299976 -1.071538 -0.773818
C  1.119078 -0.848384 -0.468674
C  -0.438666 1.031022 1.461164
C  1.811549 0.329776 -0.754013
C  1.842888 -1.904506 0.087991
C  -1.410967 2.833376 1.03168
C  3.160236 0.46178 -0.471907
C  3.185763 -1.790093 0.387715
C  3.840515 -0.599008 0.1066
H  -2.667731 -1.473379 -1.611386
H  -2.803061 -3.310514 -0.027408
H  -2.061593 -2.40231 1.292697
H  -3.654035 -3.109508 1.493464
H  -5.613491 -0.829611 -0.649325
H  -5.623154 -2.266015 0.333353
H  -4.884914 -2.327627 -1.256171
H  -4.655844 -0.827699 2.124453
H  -4.355286 0.575544 1.126424
H  -3.038753 -0.184685 2.039705
H  -0.514794 -1.975237 -1.334307
H  -2.520423 1.966259 -0.615986
H  0.176202 0.268327 1.912606
H  1.337009 -2.839461 0.294269
H  -1.757765 3.854591 1.059576
H  3.678861 1.378855 -0.713436
H  3.722696 -2.620114 0.824085
H  -4.190528 0.294458 -1.766802
totalener: -1742.14464584 hartree
nucrepener: 2029.15760720 hartree
electener: -3771.30225304 hartree
oneelecener: -6398.03364165 hartree
twoeener: 2626.73138861 hartree
kineticenergy: 1737.28408297 hartree
xcener: -122.775009734326 hartree
chargesum: 1.0000000
charge: -0.039841 -0.003941 -0.364535 0.085855 -0.043028 -0.253445 0.235126 0.022654 -0.332241 -0.321412 -0.350762 -0.061337 0.046186 -0.110636 0.125094 0.038060 -0.142975 0.182497 -0.111005 -0.139435 0.080260 0.134125 0.105961 0.089201 0.118957 0.092308 0.108116 0.121350 0.123743 0.097676 0.091679 0.134940 0.239868 0.191649 0.136625 0.188364 0.133064 0.143761 0.207472
qa: -0.0398 -0.0039 -0.3645 0.0859 -0.0430 -0.2534 0.2351 0.0227 -0.3322 -0.3214 -0.3508 -0.0613 0.0462 -0.1106 0.1251 0.0381 -0.1430 0.1825 -0.1110 -0.1394 0.0803 0.1341 0.1060 0.0892 0.1190 0.0923 0.1081 0.1213 0.1237 0.0977 0.0917 0.1349 0.2399 0.1916 0.1366 0.1884 0.1331 0.1438 0.2075
va: 1.2996 1.3030 2.0481 3.4236 3.4058 3.0470 3.6258 4.0116 3.9481 3.9314 3.9395 3.8118 3.8269 3.6576 3.9996 3.9344 3.9621 3.9613 4.0242 4.0306 4.0310 1.0033 1.0081 0.9985 1.0110 1.0096 1.0112 0.9986 1.0131 1.0174 1.0026 1.0069 1.0285 0.9788 1.0066 0.9792 1.0182 1.0082 1.0385
dispersion: -0.023662345 hartree
energy: -1742.168308181822 hartree
dipole: -46.02463 42.87571 -3.14892 -16.53623 16.58197 0.04575 5.83526 -5.80484 0.03042
magnitude: 3.14940 au
magnitude: 8.00515 debye
