program: Orca
programVersion: 5.0.2
elementType: Cl Cl O N N N C C C C C C C C C C C C C C C H H H H H H H H H H H H H H H H H H
charge: 1
multiplicity: 1
keywords: wb97x-d3
keywords: def2-TZVPP
keywords: def2/J RIJCOSX
keywords: DEFGRID2
keywords: scfconv7
keywords: smallprint printgap noloewdin
keywords: NOSOSCF
formula: C15H18Cl2N3O
InChI: InChI=1/C15H18Cl2N3O/c1-15(2,3)14(21)13(20-9-18-8-19-20)6-10-4-5-11(16)7-12(10)17/h4-9,14,19,21H,1-3H3
39 atoms
Cl 1.239625 -2.787918 0.086113
Cl 5.438696 0.546676 0.160481
O  -3.316673 1.087994 -1.463497
N  -1.210359 1.126449 0.421521
N  -1.782025 2.33674 0.368171
N  -0.621458 2.247074 2.203068
C  -3.676761 -0.885613 0.009241
C  -2.792161 -0.153568 -1.03177
C  -2.957324 -2.161216 0.445552
C  -4.985046 -1.280069 -0.686315
C  -4.0092 -0.034381 1.235708
C  -1.381155 0.135291 -0.588451
C  -0.314796 -0.498348 -1.06626
C  1.090947 -0.225428 -0.738983
C  -0.508538 1.104569 1.552925
C  1.913258 -1.22866 -0.232094
C  1.654125 1.029252 -0.962105
C  -1.419194 2.992069 1.452011
C  3.250001 -1.007159 0.050193
C  2.987082 1.278879 -0.687783
C  3.773175 0.254404 -0.183847
H  -2.690773 -0.836139 -1.885123
H  -2.041955 -1.953221 1.002264
H  -3.604262 -2.751317 1.0965
H  -2.692037 -2.789987 -0.407853
H  -4.801306 -1.853938 -1.597401
H  -5.605742 -0.419523 -0.949249
H  -5.587836 -1.90136 -0.022329
H  -4.746122 -0.555283 1.850153
H  -4.444702 0.930614 0.971098
H  -3.146302 0.140467 1.879696
H  -0.510646 -1.295603 -1.775015
H  -2.435029 2.562667 -0.383321
H  0.050752 0.237918 1.869938
H  1.042898 1.822543 -1.373939
H  -1.75209 3.995738 1.664285
H  3.868089 -1.800985 0.446922
H  3.405582 2.258285 -0.873729
H  -4.247294 0.990924 -1.697315
elementType: Cl O N C H
totalener: -1742.23788497 hartree
nucrepener: 2006.45754184 hartree
electener: -3748.69542681 hartree
oneelecener: -6351.57501268 hartree
twoeener: 2602.87958587 hartree
cpcmener: -0.09636192 hartree
kineticenergy: 1737.21931972 hartree
xcener: -122.759659244748 hartree
chargesum: 1.0000000
charge: -0.061354 -0.070893 -0.408225 0.095542 -0.016064 -0.335316 0.278510 0.085188 -0.352559 -0.331984 -0.373492 -0.056666 -0.018602 -0.046885 0.164485 0.033498 -0.117611 0.204506 -0.156905 -0.160524 0.114012 0.121929 0.085398 0.109052 0.105504 0.106211 0.097211 0.099545 0.112386 0.102422 0.099816 0.160796 0.256688 0.196661 0.157438 0.202262 0.131224 0.148881 0.237915
qa: -0.0614 -0.0709 -0.4082 0.0955 -0.0161 -0.3353 0.2785 0.0852 -0.3526 -0.3320 -0.3735 -0.0567 -0.0186 -0.0469 0.1645 0.0335 -0.1176 0.2045 -0.1569 -0.1605 0.1140 0.1219 0.0854 0.1091 0.1055 0.1062 0.0972 0.0995 0.1124 0.1024 0.0998 0.1608 0.2567 0.1967 0.1574 0.2023 0.1312 0.1489 0.2379
va: 1.2651 1.2318 2.0107 3.4179 3.4444 3.0534 3.6434 4.0158 3.9503 3.9298 3.9524 3.8270 3.8283 3.6260 3.9851 3.9551 3.8520 3.9432 4.0829 4.0229 3.8787 1.0090 1.0051 1.0074 1.0063 1.0028 1.0079 1.0053 1.0067 1.0160 0.9986 1.0017 0.9972 0.9817 0.9978 0.9739 1.0204 1.0041 1.0101
dispersion: -0.023816074 hartree
energy: -1742.261701042646 hartree
dipole: -46.68659 42.54002 -4.14657 -0.24712 2.54900 2.30187 -0.93815 0.40530 -0.53285
magnitude: 4.77248 au
magnitude: 12.13068 debye
