program: Orca
programVersion: 5.0.2
elementType: Cl Cl O N N N C C C C C C C C C C C C C C C H H H H H H H H H H H H H H H H H H
charge: 1
multiplicity: 1
keywords: wb97x-d3
keywords: def2-TZVPP
keywords: def2/J RIJCOSX
keywords: DEFGRID2
keywords: scfconv7
keywords: smallprint printgap noloewdin
keywords: NOSOSCF
formula: C15H18Cl2N3O
InChI: InChI=1/C15H18Cl2N3O/c1-15(2,3)14(21)13(20-9-18-8-19-20)6-10-4-5-11(16)7-12(10)17/h4-9,14,19,21H,1-3H3
39 atoms
Cl 1.025123 1.678403 -1.541535
Cl 5.486081 -0.4310 0.505946
O  -3.299346 0.434839 -1.502311
N  -1.201676 0.746746 0.378633
N  -1.792566 1.93064 0.167375
N  -0.584328 2.116363 1.968413
C  -3.657698 -1.287457 0.263424
C  -2.77496 -0.724612 -0.879902
C  -4.978552 -1.760147 -0.356099
C  -3.972082 -0.272693 1.364024
C  -2.944477 -2.495871 0.867896
C  -1.365012 -0.374091 -0.482423
C  -0.299559 -1.070664 -0.867384
C  1.116004 -0.846904 -0.539058
C  -0.475619 0.893166 1.483002
C  1.811502 0.335175 -0.789145
C  1.826563 -1.90406 0.029496
C  -1.410126 2.735481 1.135366
C  3.153722 0.473159 -0.473381
C  3.162888 -1.790702 0.362844
C  3.814732 -0.595013 0.107581
H  -2.677787 -1.532042 -1.616521
H  -5.571445 -2.286629 0.392873
H  -5.599073 -0.935833 -0.716833
H  -4.811215 -2.445974 -1.189067
H  -4.410789 0.646022 0.972004
H  -3.10175 -0.012915 1.968338
H  -4.702937 -0.703488 2.050665
H  -2.024859 -2.215724 1.385036
H  -2.688786 -3.235443 0.105743
H  -3.592569 -2.984647 1.596593
H  -0.506183 -1.959646 -1.452831
H  -4.249841 0.336664 -1.63127
H  0.094564 0.086291 1.915305
H  1.312304 -2.836895 0.221142
H  -1.750482 3.755756 1.207384
H  3.672371 1.398154 -0.684042
H  3.684982 -2.624496 0.810443
H  -2.465601 2.03756 -0.593183
elementType: Cl O N C H
totalener: -1742.23099483 hartree
nucrepener: 2032.05353381 hartree
electener: -3774.28452864 hartree
oneelecener: -6402.72257289 hartree
twoeener: 2628.43804425 hartree
cpcmener: -0.10584770 hartree
kineticenergy: 1737.24326362 hartree
xcener: -122.765309891632 hartree
chargesum: 1.0000000
charge: -0.067217 -0.077214 -0.418361 0.078450 -0.024441 -0.331960 0.286642 0.075382 -0.336950 -0.378133 -0.363717 -0.086508 0.085185 -0.051753 0.154956 0.050058 -0.162488 0.206487 -0.132744 -0.165354 0.108249 0.118784 0.098234 0.098749 0.106180 0.105250 0.099851 0.110855 0.098762 0.107029 0.107716 0.147663 0.247803 0.206858 0.152520 0.202910 0.127715 0.149434 0.265118
qa: -0.0672 -0.0772 -0.4184 0.0784 -0.0244 -0.3320 0.2866 0.0754 -0.3370 -0.3781 -0.3637 -0.0865 0.0852 -0.0518 0.1550 0.0501 -0.1625 0.2065 -0.1327 -0.1654 0.1082 0.1188 0.0982 0.0987 0.1062 0.1053 0.0999 0.1109 0.0988 0.1070 0.1077 0.1477 0.2478 0.2069 0.1525 0.2029 0.1277 0.1494 0.2651
va: 1.2624 1.2260 2.0049 3.4092 3.4204 3.0488 3.6458 4.0308 3.9293 3.9559 3.9522 3.8724 3.7545 3.6558 3.9893 3.8871 3.9547 3.9468 4.0575 4.0112 3.8706 1.0095 1.0048 1.0075 1.0029 1.0133 1.0002 1.0056 0.9979 1.0056 1.0053 1.0037 1.0017 0.9776 0.9997 0.9745 1.0210 1.0033 0.9916
dispersion: -0.023975404 hartree
energy: -1742.254970236489 hartree
dipole: -45.94612 41.72400 -4.22212 -16.12481 16.24363 0.11882 6.09220 -5.98020 0.11200
magnitude: 4.22528 au
magnitude: 10.73981 debye
