program: Orca
programVersion: 5.0.2
elementType: Cl Cl O N N N C C C C C C C C C C C C C C C H H H H H H H H H H H H H H H H H H
charge: 1
multiplicity: 1
keywords: wb97x-d3
keywords: def2-TZVPP
keywords: def2/J RIJCOSX
keywords: DEFGRID2
keywords: scfconv7
keywords: smallprint printgap noloewdin
keywords: NOSOSCF
formula: C15H18Cl2N3O
InChI: InChI=1/C15H18Cl2N3O/c1-15(2,3)14(21)13(20-9-18-8-19-20)6-10-4-5-11(16)7-12(10)17/h4-9,14,19,21H,1-3H3
39 atoms
Cl 1.098075 -2.788963 -0.273209
Cl 5.411071 0.359975 0.224978
O  -3.354305 1.345238 -1.260302
N  -1.179095 1.115561 0.543774
N  -1.705436 2.342203 0.668594
N  -0.52706 1.952489 2.457562
C  -3.6742 -0.800318 -0.040963
C  -2.823938 0.057412 -1.011493
C  -2.944323 -2.120758 0.200986
C  -5.007451 -1.098689 -0.736041
C  -3.962599 -0.112435 1.294233
C  -1.398099 0.270096 -0.581796
C  -0.360598 -0.327948 -1.15681
C  1.053457 -0.146908 -0.804894
C  -0.468211 0.910662 1.648355
C  1.832596 -1.230545 -0.40886
C  1.661548 1.104205 -0.87444
C  -1.306646 2.820932 1.828269
C  3.171976 -1.092352 -0.087644
C  2.998432 1.2725 -0.559499
C  3.739943 0.168465 -0.169979
H  -2.761611 -0.512274 -1.94748
H  -2.013329 -1.982582 0.753315
H  -3.574143 -2.792609 0.785642
H  -2.705089 -2.626664 -0.737186
H  -5.587312 -1.805639 -0.141459
H  -4.855788 -1.540187 -1.723058
H  -5.631242 -0.209352 -0.85475
H  -3.081991 -0.024821 1.932116
H  -4.688228 -0.704591 1.854888
H  -4.395764 0.880552 1.164921
H  -0.593367 -1.024713 -1.954195
H  -4.309134 1.286128 -1.381167
H  0.056338 -0.012732 1.836586
H  1.082389 1.960253 -1.195527
H  -1.60114 3.795956 2.181383
H  3.755426 -1.947425 0.224843
H  3.451686 2.251428 -0.624904
H  -2.362433 2.692759 -0.02758
elementType: Cl O N C H
totalener: -1742.23300186 hartree
nucrepener: 2011.80534097 hartree
electener: -3754.03834283 hartree
oneelecener: -6362.02589741 hartree
twoeener: 2607.98755457 hartree
cpcmener: -0.10903886 hartree
kineticenergy: 1737.24032844 hartree
xcener: -122.763597091303 hartree
chargesum: 1.0000000
charge: -0.066731 -0.079552 -0.421227 0.097625 -0.013804 -0.344738 0.290966 0.091626 -0.357116 -0.335913 -0.375794 -0.056948 -0.015885 -0.038960 0.165323 0.035571 -0.114605 0.207856 -0.161574 -0.162964 0.116576 0.117741 0.084487 0.107735 0.105804 0.097975 0.104696 0.097264 0.101421 0.110079 0.104290 0.163980 0.246407 0.197337 0.159827 0.203238 0.131072 0.149113 0.257803
qa: -0.0667 -0.0796 -0.4212 0.0976 -0.0138 -0.3447 0.2910 0.0916 -0.3571 -0.3359 -0.3758 -0.0569 -0.0159 -0.0390 0.1653 0.0356 -0.1146 0.2079 -0.1616 -0.1630 0.1166 0.1177 0.0845 0.1077 0.1058 0.0980 0.1047 0.0973 0.1014 0.1101 0.1043 0.1640 0.2464 0.1973 0.1598 0.2032 0.1311 0.1491 0.2578
va: 1.2585 1.2228 2.0019 3.4170 3.4555 3.0531 3.6348 4.0268 3.9489 3.9309 3.9546 3.8212 3.8182 3.6319 3.9884 3.9454 3.8516 3.9411 4.0902 4.0187 3.8601 1.0110 1.0054 1.0079 1.0060 1.0048 1.0033 1.0082 0.9986 1.0055 1.0156 0.9998 1.0031 0.9821 0.9974 0.9735 1.0206 1.0037 0.9929
dispersion: -0.024036675 hartree
energy: -1742.257038535805 hartree
dipole: -46.12538 41.94705 -4.17834 0.92162 1.64781 2.56943 -0.32424 0.16633 -0.15791
magnitude: 4.90769 au
magnitude: 12.47435 debye
