program: Orca
programVersion: 5.0.2
elementType: Cl Cl O N N N C C C C C C C C C C C C C C C H H H H H H H H H H H H H H H H H H
charge: 1
multiplicity: 1
keywords: wb97x-d3
keywords: def2-TZVPP
keywords: def2/J RIJCOSX
keywords: DEFGRID2
keywords: scfconv7
keywords: smallprint printgap noloewdin
keywords: NOSOSCF
formula: C15H18Cl2N3O
InChI: InChI=1/C15H18Cl2N3O/c1-15(2,3)14(21)13(20-9-18-8-19-20)6-10-4-5-11(16)7-12(10)17/h4-9,14,18,21H,1-3H3
39 atoms
Cl 1.088989 1.762965 -1.518612
Cl 5.392296 -0.663526 0.514813
O  -3.500982 0.675029 -1.194403
N  -1.214497 0.913257 0.347228
N  -0.455224 0.783137 1.457104
N  -1.124955 2.839252 1.214081
C  -3.609525 -1.33313 0.246059
C  -2.864344 -0.536747 -0.858987
C  -5.047821 -1.566648 -0.230724
C  -3.640627 -0.605859 1.589101
C  -2.931536 -2.691753 0.41642
C  -1.434811 -0.198312 -0.517947
C  -0.405994 -0.933863 -0.928622
C  1.019586 -0.797603 -0.604289
C  -1.617278 2.159479 0.190854
C  1.782543 0.352142 -0.796868
C  1.67162 -1.921059 -0.094422
C  -0.410471 1.968421 1.969435
C  3.125428 0.404095 -0.457423
C  3.007335 -1.896722 0.257652
C  3.722104 -0.723076 0.078975
H  -2.813714 -1.197468 -1.734086
H  -5.078182 -1.998948 -1.233681
H  -5.55026 -2.264402 0.440627
H  -5.647477 -0.653599 -0.232761
H  -4.001015 0.420525 1.499252
H  -2.662486 -0.586008 2.071102
H  -4.314532 -1.125269 2.272705
H  -2.899475 -3.245866 -0.524434
H  -3.484544 -3.297777 1.135628
H  -1.909296 -2.600085 0.786554
H  -0.660787 -1.803035 -1.525051
H  -4.407106 0.487899 -1.463155
H  -2.198157 2.571332 -0.615548
H  1.106874 -2.834392 0.041578
H  0.105611 2.240047 2.874917
H  3.694821 1.309243 -0.61634
H  3.479427 -2.780023 0.663761
H  -1.254293 3.831436 1.379938
elementType: Cl O N C H
totalener: -1742.23822256 hartree
nucrepener: 2031.04946442 hartree
electener: -3773.28768698 hartree
oneelecener: -6403.06190493 hartree
twoeener: 2629.77421795 hartree
cpcmener: -0.10695166 hartree
kineticenergy: 1737.25746519 hartree
xcener: -122.765211039090 hartree
chargesum: 1.0000000
charge: -0.070509 -0.080090 -0.417709 0.129656 -0.280081 -0.060381 0.282687 0.105831 -0.347487 -0.370571 -0.377418 -0.058330 0.005901 0.018084 0.179626 0.014214 -0.170145 0.168161 -0.132640 -0.173746 0.108467 0.124350 0.114045 0.096829 0.097068 0.101685 0.092882 0.109450 0.105892 0.106192 0.099440 0.150701 0.234676 0.217098 0.152738 0.199552 0.126410 0.148346 0.249128
qa: -0.0705 -0.0801 -0.4177 0.1297 -0.2801 -0.0604 0.2827 0.1058 -0.3475 -0.3706 -0.3774 -0.0583 0.0059 0.0181 0.1796 0.0142 -0.1701 0.1682 -0.1326 -0.1737 0.1085 0.1244 0.1140 0.0968 0.0971 0.1017 0.0929 0.1094 0.1059 0.1062 0.0994 0.1507 0.2347 0.2171 0.1527 0.1996 0.1264 0.1483 0.2491
va: 1.2575 1.2230 2.0011 3.4685 2.8307 3.5426 3.6154 4.0148 3.9248 3.9519 3.9573 3.8191 3.7918 3.6096 3.8856 3.8944 3.9786 3.9179 4.0514 4.0155 3.8671 1.0077 1.0004 1.0053 1.0074 1.0146 1.0055 1.0052 1.0056 1.0055 0.9974 0.9989 1.0107 0.9916 0.9986 0.9778 1.0216 1.0041 0.9638
dispersion: -0.023309013 hartree
energy: -1742.261531577525 hartree
dipole: -45.06083 41.37129 -3.68954 -14.11934 16.90213 2.78279 6.42030 -5.32832 1.09198
magnitude: 4.74858 au
magnitude: 12.06994 debye
