program: Orca
programVersion: 5.0.2
elementType: Cl Cl O N N N C C C C C C C C C C C C C C C H H H H H H H H H H H H H H H H H H
charge: 1
multiplicity: 1
keywords: wb97x-d3
keywords: def2-TZVPP
keywords: def2/J RIJCOSX
keywords: DEFGRID2
keywords: scfconv7
keywords: smallprint printgap noloewdin
keywords: NOSOSCF
formula: C15H18Cl2N3O
InChI: InChI=1/C15H18Cl2N3O/c1-15(2,3)14(21)13(20-9-18-8-19-20)6-10-4-5-11(16)7-12(10)17/h4-9,14,18,21H,1-3H3
39 atoms
Cl 1.194782 1.349085 1.79917
Cl 5.349634 -0.549932 -0.972629
O  -2.763576 -1.454957 1.918863
N  -1.231541 1.105559 -0.055647
N  -0.492033 1.318982 -1.16247
N  -1.208554 3.200546 -0.333046
C  -3.69377 -1.088567 -0.34124
C  -2.851887 -0.545642 0.848681
C  -3.765747 -0.033697 -1.445136
C  -5.116424 -1.350878 0.163466
C  -3.112403 -2.380027 -0.908088
C  -1.430234 -0.203224 0.465841
C  -0.410227 -1.051338 0.561196
C  1.003167 -0.855138 0.218324
C  -1.665501 2.241557 0.454329
C  1.814802 0.173816 0.691468
C  1.599475 -1.810712 -0.605931
C  -0.486322 2.602836 -1.313344
C  3.149637 0.279062 0.332217
C  2.925192 -1.72926 -0.985217
C  3.689054 -0.673316 -0.51445
H  -3.353798 0.375926 1.179909
H  -2.812388 0.102806 -1.957035
H  -4.485589 -0.344596 -2.203824
H  -4.092382 0.937004 -1.06361
H  -5.765055 -1.613476 -0.673479
H  -5.54247 -0.467962 0.64547
H  -5.171024 -2.183452 0.868751
H  -2.123317 -2.230673 -1.343858
H  -3.759849 -2.758419 -1.701229
H  -3.035634 -3.163725 -0.153146
H  -0.657073 -2.055685 0.883041
H  -3.656625 -1.682486 2.198602
H  -2.259897 2.373752 1.344028
H  0.997943 -2.635906 -0.965328
H  0.00564 3.136241 -2.109087
H  3.756435 1.088084 0.714723
H  3.353452 -2.480518 -1.633699
H  -1.369847 4.194648 -0.210281
elementType: Cl O N C H
totalener: -1742.23860359 hartree
nucrepener: 2024.31222817 hartree
electener: -3766.55083176 hartree
oneelecener: -6389.60183565 hartree
twoeener: 2623.05100389 hartree
cpcmener: -0.12036920 hartree
kineticenergy: 1737.23786731 hartree
xcener: -122.762415153813 hartree
chargesum: 1.0000000
charge: -0.072264 -0.081075 -0.412070 0.136600 -0.280079 -0.060144 0.274050 0.094950 -0.372789 -0.339249 -0.370855 -0.010916 -0.022357 -0.006979 0.183268 0.005216 -0.154312 0.170644 -0.142477 -0.191766 0.118031 0.130152 0.095574 0.107167 0.107743 0.097180 0.109886 0.095807 0.097322 0.109426 0.099274 0.147374 0.235668 0.222199 0.152316 0.200176 0.127599 0.148784 0.250928
qa: -0.0723 -0.0811 -0.4121 0.1366 -0.2801 -0.0601 0.2741 0.0950 -0.3728 -0.3392 -0.3709 -0.0109 -0.0224 -0.0070 0.1833 0.0052 -0.1543 0.1706 -0.1425 -0.1918 0.1180 0.1302 0.0956 0.1072 0.1077 0.0972 0.1099 0.0958 0.0973 0.1094 0.0993 0.1474 0.2357 0.2222 0.1523 0.2002 0.1276 0.1488 0.2509
va: 1.2571 1.2222 2.0221 3.4773 2.8296 3.5457 3.6258 4.0456 3.9560 3.9227 3.9479 3.6956 3.7908 3.5953 3.8883 3.9095 3.9682 3.9213 4.0631 4.0299 3.8568 1.0059 1.0043 1.0071 1.0046 1.0050 1.0008 1.0090 0.9988 1.0040 1.0189 1.0159 1.0079 0.9697 0.9993 0.9772 1.0218 1.0047 0.9625
dispersion: -0.023072798 hartree
energy: -1742.261676385772 hartree
dipole: -46.60823 42.31173 -4.29649 -9.76799 14.08354 4.31555 -7.03916 6.70034 -0.33882
magnitude: 6.09907 au
magnitude: 15.50259 debye
