program: Orca
programVersion: 5.0.2
elementType: O N C C C C C C C C C C C C C C C C C C H H H H H H H H H H H H H H H H H H H H H H H H H H H H H H H H H H H H
charge: 1
multiplicity: 1
keywords: wb97x-d3
keywords: def2-TZVPP
keywords: def2/J RIJCOSX
keywords: DEFGRID2
keywords: scfconv7
keywords: smallprint printgap noloewdin
keywords: NOSOSCF
formula: C18H36NO
InChI: InChI=1/C18H36NO/c1-16-14-19(15-17(2)20-16)18-12-10-8-6-4-3-5-7-9-11-13-18/h16-19H,3-15H2,1-2H3
56 atoms
O  4.476194 0.682078 -0.346594
N  1.619666 0.408909 -0.147284
C  0.241475 0.916281 0.253568
C  -0.327379 0.126025 1.432513
C  -0.711151 0.913822 -0.943374
C  2.284066 1.314137 -1.135843
C  2.531824 0.247836 1.024571
C  3.680491 0.838338 -1.505048
C  3.916461 -0.20865 0.598378
C  -0.501516 -1.380267 1.226009
C  -1.932052 1.80525 -0.710839
C  -1.556725 -1.984763 2.155179
C  -3.039059 1.585545 -1.741586
C  -2.989418 -1.5449 1.852788
C  -3.735888 0.228794 -1.632498
C  -3.542967 -2.092155 0.538748
C  -4.592806 0.068809 -0.373846
C  -4.80903 -1.384082 0.053081
C  3.676705 -0.388944 -2.405988
C  4.829757 -0.26358 1.801637
H  0.422411 1.94447 0.577897
H  -1.29501 0.585699 1.634805
H  0.256366 0.31386 2.335359
H  -1.016438 -0.112821 -1.154586
H  -0.219822 1.271532 -1.848112
H  2.318161 2.299184 -0.670692
H  1.676377 1.375465 -2.032709
H  2.111252 -0.494075 1.696976
H  2.568431 1.212307 1.534004
H  4.132272 1.661617 -2.062888
H  3.835004 -1.216941 0.171406
H  0.450316 -1.890523 1.398705
H  -0.766655 -1.602037 0.189771
H  -1.609575 2.84919 -0.74224
H  -2.340247 1.652769 0.290535
H  -1.309544 -1.725525 3.189085
H  -1.495303 -3.075499 2.095985
H  -2.619519 1.6985 -2.745913
H  -3.781924 2.381703 -1.634381
H  -3.039812 -0.45271 1.857756
H  -3.640913 -1.866186 2.670604
H  -2.983372 -0.562587 -1.680379
H  -4.366824 0.078757 -2.512676
H  -3.753976 -3.158308 0.6641
H  -2.780557 -2.039156 -0.243396
H  -5.564515 0.54009 -0.545337
H  -4.149861 0.621824 0.458641
H  -5.232718 -1.945298 -0.785736
H  -5.562872 -1.414923 0.8462
H  3.120474 -1.236963 -2.004022
H  3.227706 -0.130837 -3.364501
H  4.696489 -0.720571 -2.59776
H  4.447502 -0.977079 2.530974
H  5.828132 -0.589938 1.512259
H  4.909852 0.710101 2.28613
H  1.492985 -0.513718 -0.576907
elementType: O N C H
totalener: -837.53708681 hartree
nucrepener: 1772.84140713 hartree
electener: -2610.37849394 hartree
oneelecener: -4632.59476379 hartree
twoeener: 2022.21626985 hartree
cpcmener: -0.10689286 hartree
kineticenergy: 833.16471609 hartree
xcener: -86.059189878661 hartree
chargesum: 1.0000000
charge: -0.396701 0.207697 0.059538 -0.218613 -0.214476 -0.137343 -0.155788 0.151603 0.143418 -0.178676 -0.148899 -0.164662 -0.158613 -0.139325 -0.159030 -0.140780 -0.155694 -0.156349 -0.287079 -0.288434 0.123321 0.122876 0.115070 0.104663 0.113732 0.138427 0.138469 0.138421 0.143881 0.102456 0.099442 0.096239 0.095137 0.091285 0.081384 0.078596 0.076823 0.073590 0.079340 0.066962 0.083413 0.076112 0.087468 0.081743 0.068164 0.085762 0.074063 0.074260 0.071311 0.088447 0.100945 0.100711 0.095516 0.100032 0.092981 0.177165
qa: -0.3967 0.2077 0.0595 -0.2186 -0.2145 -0.1373 -0.1558 0.1516 0.1434 -0.1787 -0.1489 -0.1647 -0.1586 -0.1393 -0.1590 -0.1408 -0.1557 -0.1563 -0.2871 -0.2884 0.1233 0.1229 0.1151 0.1047 0.1137 0.1384 0.1385 0.1384 0.1439 0.1025 0.0994 0.0962 0.0951 0.0913 0.0814 0.0786 0.0768 0.0736 0.0793 0.0670 0.0834 0.0761 0.0875 0.0817 0.0682 0.0858 0.0741 0.0743 0.0713 0.0884 0.1009 0.1007 0.0955 0.1000 0.0930 0.1772
va: 1.9748 3.6554 3.8167 3.9021 3.8920 3.8924 3.8144 4.0279 3.9140 3.8657 3.8798 3.9487 3.9430 3.8659 3.8571 3.8610 3.8654 3.9332 3.9396 3.9624 1.0067 0.9993 1.0004 1.0083 1.0153 1.0117 1.0049 1.0020 1.0046 0.9946 0.9936 1.0098 1.0058 1.0104 1.0135 1.0062 1.0059 1.0089 1.0052 1.0118 1.0098 1.0044 1.0067 1.0104 1.0111 1.0079 1.0049 1.0056 1.0075 1.0027 1.0080 1.0105 1.0036 1.0076 1.0082 0.9956
dispersion: -0.031004947 hartree
energy: -837.568091757754 hartree
dipole: -11.59579 13.79356 2.19777 -3.95303 4.40893 0.45590 0.80799 -1.12671 -0.31872
magnitude: 2.26707 au
magnitude: 5.76244 debye
