program: Orca
programVersion: 5.0.2
elementType: Cl N N N N C C C C C C C C C C C C C C C C C C C H H H H H H H H H H H H H H H H H H
charge: 1
multiplicity: 1
keywords: wb97x-d3
keywords: def2-TZVPP
keywords: def2/J RIJCOSX
keywords: DEFGRID2
keywords: scfconv7
keywords: smallprint printgap noloewdin
keywords: NOSOSCF
formula: C19H18ClN4
InChI: InChI=1/C19H18ClN4/c20-18-8-6-16(7-9-18)10-11-19(12-21,13-24-15-22-14-23-24)17-4-2-1-3-5-17/h1-9,14-15,23H,10-11,13H2
42 atoms
Cl -5.145046 0.373787 0.769074
N  0.322097 1.422619 0.53932
N  -0.713198 1.923779 -0.147253
N  0.672826 3.559331 0.227341
N  0.672847 0.263145 -2.569266
C  1.310533 -0.738377 -0.242813
C  0.975245 -2.25575 -0.200898
C  0.446892 0.00384 0.819078
C  2.781139 -0.455175 0.060089
C  -0.27622 -2.707237 -0.972683
C  -1.54956 -2.005358 -0.582063
C  0.966455 -0.201325 -1.559384
C  3.545435 0.411417 -0.713383
C  3.361627 -1.048208 1.180955
C  -2.145801 -2.241478 0.656134
C  -2.140494 -1.062552 -1.420322
C  4.865031 0.680093 -0.371244
C  4.677917 -0.782155 1.517012
C  1.150234 2.441915 0.74427
C  5.43463 0.085601 0.74122
C  -3.250386 -1.518523 1.079922
C  -3.249126 -0.328324 -1.012701
C  -0.475654 3.215724 -0.322974
C  -3.789045 -0.544865 0.249613
H  0.891502 -2.554512 0.847453
H  1.835292 -2.793633 -0.600758
H  -0.559235 -0.401349 0.888861
H  0.908722 -0.101178 1.798819
H  -0.378925 -3.781704 -0.804552
H  -0.103217 -2.589389 -2.043698
H  3.1353 0.873089 -1.602646
H  2.798243 -1.737282 1.799253
H  -1.475862 1.324536 -0.467603
H  -1.741772 -0.898369 -2.41309
H  5.44764 1.350453 -0.9883
H  5.115635 -1.259274 2.383221
H  2.082947 2.331568 1.276793
H  6.46401 0.290226 1.001579
H  -3.697913 -1.717385 2.044099
H  -3.7215 0.369675 -1.692931
H  -1.154112 3.871994 -0.845807
H  -1.739192 -3.00213 1.313108
totalener: -1413.87370045 hartree
nucrepener: 2164.18443477 hartree
electener: -3578.05813522 hartree
oneelecener: -6204.79927392 hartree
twoeener: 2626.74113870 hartree
kineticenergy: 1409.05116429 hartree
xcener: -115.516255117768 hartree
chargesum: 1.0000000
charge: -0.017923 0.076644 -0.063300 -0.267890 0.036534 0.784048 -0.260709 -0.287679 -0.087350 -0.118101 0.099954 -0.509544 -0.203353 -0.250148 -0.210910 -0.233022 -0.101829 -0.138109 0.158014 -0.103105 -0.087929 -0.242241 0.194346 0.059041 0.109388 0.131429 0.141721 0.165725 0.124336 0.119771 0.149845 0.135781 0.253171 0.158183 0.151289 0.148481 0.189140 0.152210 0.146579 0.178403 0.185219 0.133888
qa: -0.0179 0.0766 -0.0633 -0.2679 0.0365 0.7840 -0.2607 -0.2877 -0.0874 -0.1181 0.1000 -0.5095 -0.2034 -0.2501 -0.2109 -0.2330 -0.1018 -0.1381 0.1580 -0.1031 -0.0879 -0.2422 0.1943 0.0590 0.1094 0.1314 0.1417 0.1657 0.1243 0.1198 0.1498 0.1358 0.2532 0.1582 0.1513 0.1485 0.1891 0.1522 0.1466 0.1784 0.1852 0.1339
va: 1.2915 3.3410 3.4454 3.0757 3.0367 3.1660 3.8986 3.9050 3.5016 3.8132 3.4560 3.9755 3.9139 4.0420 3.9710 3.8524 3.9838 4.0363 4.0042 3.9661 3.9267 3.9050 3.9601 3.9739 1.0022 1.0112 1.0342 1.0018 1.0057 1.0065 1.0157 1.0073 1.0002 1.0113 0.9976 0.9988 0.9786 0.9951 1.0062 0.9994 0.9799 1.0081
dispersion: -0.026683044 hartree
energy: -1413.900383491589 hartree
dipole: 20.28510 -19.45961 0.82549 -9.98665 10.40018 0.41353 0.84167 0.37495 1.21663
magnitude: 1.52729 au
magnitude: 3.88207 debye
