program: Orca
programVersion: 5.0.2
elementType: Cl N N N N C C C C C C C C C C C C C C C C C C C H H H H H H H H H H H H H H H H H H
charge: 1
multiplicity: 1
keywords: wb97x-d3
keywords: def2-TZVPP
keywords: def2/J RIJCOSX
keywords: DEFGRID2
keywords: scfconv7
keywords: smallprint printgap noloewdin
keywords: NOSOSCF
formula: C19H18ClN4
InChI: InChI=1/C19H18ClN4/c20-18-8-6-16(7-9-18)10-11-19(12-21,13-24-15-22-14-23-24)17-4-2-1-3-5-17/h1-9,14-15,23H,10-11,13H2
42 atoms
Cl -3.894107 -1.586185 2.960399
N  2.216231 2.294546 -1.451414
N  2.103159 2.794377 -0.212372
N  4.177621 3.039243 -0.824797
N  3.009324 -1.091443 -2.201884
C  0.821739 0.23244 -1.669155
C  -0.330898 -0.329487 -2.536185
C  1.117695 1.668167 -2.17138
C  0.533235 0.288558 -0.17385
C  -0.795243 -1.745965 -2.181772
C  -1.606963 -1.807696 -0.9164
C  2.031603 -0.544292 -1.945135
C  -0.611062 0.954152 0.269444
C  1.414351 -0.233658 0.764787
C  -1.099797 -2.381756 0.242047
C  -2.874743 -1.235807 -0.869029
C  -0.875789 1.07127 1.624819
C  1.152335 -0.105729 2.123363
C  3.492179 2.456662 -1.790113
C  0.009633 0.544016 2.557477
C  -1.803895 -2.333842 1.434007
C  -3.594782 -1.180394 0.312608
C  3.304167 3.230688 0.143354
C  -3.041197 -1.711406 1.467727
H  0.001894 -0.313055 -3.577493
H  -1.178098 0.358942 -2.476403
H  1.398588 1.667852 -3.224153
H  0.233236 2.296515 -2.066213
H  0.063737 -2.41895 -2.123701
H  -1.393777 -2.104169 -3.022529
H  -1.334795 1.345054 -0.435763
H  2.306255 -0.761501 0.45123
H  1.244916 2.684063 0.323126
H  -3.317027 -0.821784 -1.76873
H  -1.785918 1.555259 1.95218
H  1.842154 -0.529924 2.840493
H  3.883117 2.143625 -2.746728
H  -0.203483 0.627868 3.614349
H  -1.390654 -2.77291 2.331368
H  -4.579174 -0.733543 0.3364
H  3.503401 3.680384 1.103954
H  -0.130768 -2.865295 0.224234
totalener: -1413.86843280 hartree
nucrepener: 2195.78216488 hartree
electener: -3609.65059768 hartree
oneelecener: -6268.68061894 hartree
twoeener: 2659.03002126 hartree
kineticenergy: 1409.07971773 hartree
xcener: -115.520949669607 hartree
chargesum: 1.0000000
charge: -0.048657 0.073718 -0.055362 -0.266679 0.066580 0.754304 -0.204880 -0.216330 -0.307606 -0.160579 0.133112 -0.456877 -0.269107 -0.155535 -0.150889 -0.257032 -0.141382 -0.087448 0.175857 -0.108271 -0.146510 -0.091976 0.185984 0.058025 0.122855 0.110048 0.150888 0.170839 0.113153 0.127128 0.130952 0.153522 0.243774 0.122395 0.156170 0.157769 0.185770 0.157281 0.129351 0.134052 0.191481 0.120111
qa: -0.0487 0.0737 -0.0554 -0.2667 0.0666 0.7543 -0.2049 -0.2163 -0.3076 -0.1606 0.1331 -0.4569 -0.2691 -0.1555 -0.1509 -0.2570 -0.1414 -0.0874 0.1759 -0.1083 -0.1465 -0.0920 0.1860 0.0580 0.1229 0.1100 0.1509 0.1708 0.1132 0.1271 0.1310 0.1535 0.2438 0.1224 0.1562 0.1578 0.1858 0.1573 0.1294 0.1341 0.1915 0.1201
va: 1.2597 3.3648 3.4682 3.0712 3.0703 3.3185 3.8853 3.8418 3.4927 3.9103 3.4688 4.0383 3.9633 3.8490 3.9567 3.9800 3.9660 3.9156 3.9944 3.9104 3.9328 3.9557 3.9559 3.9252 1.0129 1.0014 1.0063 0.9880 1.0121 0.9993 1.0253 1.0160 0.9883 1.0075 1.0005 0.9954 0.9841 0.9965 1.0121 1.0090 0.9780 1.0061
dispersion: -0.028820369 hartree
energy: -1413.897253171300 hartree
dipole: 5.00538 -3.28934 1.71604 4.67792 -0.91796 3.75996 -11.34394 10.14232 -1.20162
magnitude: 4.30419 au
magnitude: 10.94037 debye
