program: Orca
programVersion: 5.0.2
elementType: Cl N N N N C C C C C C C C C C C C C C C C C C C H H H H H H H H H H H H H H H H H H
charge: 1
multiplicity: 1
keywords: wb97x-d3
keywords: def2-TZVPP
keywords: def2/J RIJCOSX
keywords: DEFGRID2
keywords: scfconv7
keywords: smallprint printgap noloewdin
keywords: NOSOSCF
formula: C19H18ClN4
InChI: InChI=1/C19H18ClN4/c20-18-8-6-16(7-9-18)10-11-19(12-21,13-24-15-22-14-23-24)17-4-2-1-3-5-17/h1-9,14-15,23H,10-11,13H2
42 atoms
Cl -1.393497 -4.08191 2.790394
N  1.144769 3.22143 -0.700221
N  1.80873 2.970358 0.436985
N  3.203159 3.93152 -0.930586
N  0.921255 1.106164 -3.566614
C  -0.346796 1.310985 -1.292461
C  -1.844748 1.001402 -1.523305
C  -0.232582 2.81517 -0.934677
C  0.319839 0.503167 -0.185761
C  -2.169068 -0.441688 -1.923073
C  -2.01868 -1.423789 -0.794108
C  0.361746 1.149985 -2.563444
C  1.539631 -0.133625 -0.37721
C  -0.262114 0.480741 1.082349
C  -2.927955 -1.424092 0.258838
C  -0.951449 -2.311228 -0.743867
C  2.161048 -0.795094 0.674495
C  0.3565 -0.1853 2.12905
C  2.025051 3.802221 -1.510861
C  1.573458 -0.825039 1.927901
C  -2.752967 -2.246763 1.358948
C  -0.756755 -3.137546 0.35027
C  3.050859 3.403536 0.267298
C  -1.652284 -3.0887 1.406095
H  -2.204814 1.675049 -2.305731
H  -2.397809 1.262354 -0.617226
H  -0.610105 3.444354 -1.740246
H  -0.815926 3.038993 -0.041373
H  -1.558688 -0.739747 -2.779187
H  -3.200893 -0.446269 -2.281348
H  2.01259 -0.139442 -1.351287
H  -1.227196 0.940152 1.259589
H  1.392705 2.409837 1.177073
H  -0.247115 -2.353986 -1.565659
H  3.103083 -1.298759 0.504026
H  -0.125351 -0.224305 3.096535
H  1.771444 4.11967 -2.511345
H  2.048381 -1.354679 2.742388
H  -3.468755 -2.241062 2.169474
H  0.084959 -3.815244 0.3820
H  3.809571 3.320877 1.030348
H  -3.794934 -0.773152 0.226395
totalener: -1413.86837131 hartree
nucrepener: 2198.35357281 hartree
electener: -3612.22194412 hartree
oneelecener: -6273.82642260 hartree
twoeener: 2661.60447848 hartree
kineticenergy: 1409.08631139 hartree
xcener: -115.521866823680 hartree
chargesum: 1.0000000
charge: -0.048731 0.073774 -0.055472 -0.265522 0.067054 0.761511 -0.202576 -0.214110 -0.316609 -0.160607 0.132058 -0.465111 -0.135918 -0.264673 -0.252477 -0.152903 -0.110862 -0.149629 0.171295 -0.093002 -0.096943 -0.149862 0.185911 0.061340 0.121818 0.110971 0.153549 0.168797 0.114880 0.125938 0.153718 0.132321 0.242690 0.121035 0.157441 0.155156 0.188282 0.156958 0.133901 0.130022 0.191066 0.123523
qa: -0.0487 0.0738 -0.0555 -0.2655 0.0671 0.7615 -0.2026 -0.2141 -0.3166 -0.1606 0.1321 -0.4651 -0.1359 -0.2647 -0.2525 -0.1529 -0.1109 -0.1496 0.1713 -0.0930 -0.0969 -0.1499 0.1859 0.0613 0.1218 0.1110 0.1535 0.1688 0.1149 0.1259 0.1537 0.1323 0.2427 0.1210 0.1574 0.1552 0.1883 0.1570 0.1339 0.1300 0.1911 0.1235
va: 1.2592 3.3626 3.4697 3.0709 3.0685 3.2994 3.8850 3.8394 3.4827 3.9059 3.4699 4.0425 3.8229 3.9641 3.9834 3.9566 3.9333 3.9691 3.9964 3.8987 3.9613 3.9365 3.9554 3.9266 1.0132 1.0016 1.0060 0.9889 1.0121 1.0000 1.0156 1.0241 0.9889 1.0054 0.9961 1.0009 0.9833 0.9960 1.0090 1.0125 0.9783 1.0077
dispersion: -0.028889105 hartree
energy: -1413.897260416371 hartree
dipole: -2.71791 3.70729 0.98938 11.90233 -7.66247 4.23987 -6.25623 6.91782 0.66159
magnitude: 4.40375 au
magnitude: 11.19345 debye
