program: Orca
programVersion: 5.0.2
elementType: Cl N N N N C C C C C C C C C C C C C C C C C C C H H H H H H H H H H H H H H H H H H
charge: 1
multiplicity: 1
keywords: wb97x-d3
keywords: def2-TZVPP
keywords: def2/J RIJCOSX
keywords: DEFGRID2
keywords: scfconv7
keywords: smallprint printgap noloewdin
keywords: NOSOSCF
formula: C19H18ClN4
InChI: InChI=1/C19H18ClN4/c20-18-8-6-16(7-9-18)10-11-19(12-21,13-24-15-22-14-23-24)17-4-2-1-3-5-17/h1-9,14-15,23H,10-11,13H2
42 atoms
Cl -5.373072 -0.144825 1.077225
N  0.495782 1.601617 0.382311
N  1.569405 2.236943 0.872943
N  0.346082 3.721547 -0.146427
N  0.600641 0.241909 -2.837521
C  1.187953 -0.641854 -0.451125
C  0.900723 -2.165834 -0.349721
C  0.263727 0.168159 0.49369
C  2.643537 -0.359262 -0.088801
C  -0.356949 -2.688055 -1.051061
C  -1.64364 -2.09516 -0.548264
C  0.887358 -0.172457 -1.804247
C  3.541194 0.203745 -0.987924
C  3.08008 -0.653341 1.205633
C  -2.090759 -2.368204 0.74295
C  -2.396521 -1.229398 -1.336709
C  4.846847 0.477587 -0.59936
C  4.382234 -0.371891 1.593086
C  -0.223503 2.533575 -0.234205
C  5.269469 0.199457 0.689931
C  -3.234209 -1.773667 1.249674
C  -3.545989 -0.626363 -0.844023
C  1.454898 3.515048 0.534143
C  -3.955512 -0.893877 0.453727
H  0.878041 -2.432115 0.710237
H  1.768904 -2.676365 -0.769386
H  -0.785972 0.016962 0.253923
H  0.407302 -0.131588 1.531079
H  -0.367643 -3.771128 -0.906737
H  -0.268695 -2.534385 -2.128173
H  3.236792 0.432688 -2.001319
H  2.417514 -1.12782 1.920848
H  2.32618 1.724089 1.317892
H  -2.088135 -1.021507 -2.354331
H  5.534557 0.907221 -1.315057
H  4.707118 -0.61536 2.595756
H  -1.157265 2.307133 -0.727181
H  6.28681 0.412352 0.988359
H  -3.574645 -2.003072 2.250133
H  -4.130005 0.031889 -1.47313
H  2.188638 4.260187 0.80076
H  -1.546404 -3.068002 1.367319
totalener: -1413.87395722 hartree
nucrepener: 2137.15933709 hartree
electener: -3551.03329431 hartree
oneelecener: -6151.06056618 hartree
twoeener: 2600.02727187 hartree
kineticenergy: 1409.05609106 hartree
xcener: -115.514640599590 hartree
chargesum: 1.0000000
charge: -0.031666 0.078474 -0.063863 -0.268335 0.052812 0.849267 -0.236040 -0.213655 -0.296012 -0.107652 0.092466 -0.509908 -0.121981 -0.289791 -0.251384 -0.222513 -0.097441 -0.138497 0.184911 -0.104910 -0.085712 -0.138753 0.185393 0.052051 0.108278 0.129377 0.116433 0.171025 0.124348 0.113273 0.151305 0.133376 0.241223 0.138504 0.157626 0.157848 0.181521 0.158574 0.140668 0.145700 0.189221 0.124441
qa: -0.0317 0.0785 -0.0639 -0.2683 0.0528 0.8493 -0.2360 -0.2137 -0.2960 -0.1077 0.0925 -0.5099 -0.1220 -0.2898 -0.2514 -0.2225 -0.0974 -0.1385 0.1849 -0.1049 -0.0857 -0.1388 0.1854 0.0521 0.1083 0.1294 0.1164 0.1710 0.1243 0.1133 0.1513 0.1334 0.2412 0.1385 0.1576 0.1578 0.1815 0.1586 0.1407 0.1457 0.1892 0.1244
va: 1.2767 3.3723 3.4633 3.0738 3.0523 3.1257 3.9065 3.8830 3.5561 3.8128 3.4804 3.9984 3.9207 3.9983 4.0059 3.9170 3.9578 3.9980 3.9865 3.9367 3.9408 3.9486 3.9568 4.0003 1.0019 1.0086 1.0650 0.9927 1.0042 1.0090 1.0158 1.0216 0.9889 1.0146 0.9970 0.9983 0.9882 0.9949 1.0072 1.0069 0.9787 1.0140
dispersion: -0.025700726 hartree
energy: -1413.899657947026 hartree
dipole: 22.08681 -18.97511 3.11171 -7.89594 9.00967 1.11373 0.47596 1.37147 1.84743
magnitude: 3.78631 au
magnitude: 9.62402 debye
