program: Orca
programVersion: 5.0.2
elementType: Cl N N N N C C C C C C C C C C C C C C C C C C C H H H H H H H H H H H H H H H H H H
charge: 1
multiplicity: 1
keywords: wb97x-d3
keywords: def2-TZVPP
keywords: def2/J RIJCOSX
keywords: DEFGRID2
keywords: scfconv7
keywords: smallprint printgap noloewdin
keywords: NOSOSCF
formula: C19H18ClN4
InChI: InChI=1/C19H18ClN4/c20-18-8-6-16(7-9-18)10-11-19(12-21,13-24-15-22-14-23-24)17-4-2-1-3-5-17/h1-9,14-15,23H,10-11,13H2
42 atoms
Cl -5.288718 0.16532 0.908712
N  0.441797 1.616613 0.369105
N  1.547889 2.32246 0.641689
N  0.094196 3.696705 -0.218757
N  0.699365 0.241405 -2.757772
C  1.223239 -0.638213 -0.354922
C  0.904888 -2.156758 -0.246124
C  0.300328 0.184211 0.578479
C  2.684881 -0.386402 0.014967
C  -0.336815 -2.666179 -0.987959
C  -1.625013 -2.022589 -0.556381
C  0.951852 -0.169815 -1.714644
C  3.620008 0.062669 -0.912087
C  3.099901 -0.626176 1.327092
C  -2.290278 -1.117129 -1.378519
C  -2.15104 -2.27281 0.709962
C  4.939304 0.276427 -0.533301
C  4.416883 -0.407102 1.703265
C  -0.418737 2.48172 -0.156096
C  5.340403 0.049901 0.7733
C  -3.421552 -0.443772 -0.936969
C  -3.278664 -1.609951 1.165216
C  1.310354 3.57575 0.272132
C  -3.902302 -0.681191 0.342622
H  0.840086 -2.408039 0.816088
H  1.777366 -2.689189 -0.627511
H  -0.747688 -0.03306 0.391924
H  0.500797 -0.044018 1.624273
H  -0.382865 -3.74423 -0.816314
H  -0.197389 -2.542617 -2.063501
H  3.334161 0.244635 -1.940266
H  2.40865 -1.01103 2.068128
H  2.388066 1.86987 0.990343
H  -1.677654 -3.002856 1.356906
H  5.653956 0.619025 -1.26924
H  4.722449 -0.606302 2.721514
H  -1.407448 2.185921 -0.475156
H  6.368364 0.216141 1.064848
H  -3.937426 0.245235 -1.592502
H  -3.679091 -1.819412 2.14766
H  2.038044 4.365905 0.376329
H  -1.924869 -0.928895 -2.380595
totalener: -1413.87380025 hartree
nucrepener: 2142.61870305 hartree
electener: -3556.49250331 hartree
oneelecener: -6161.94316330 hartree
twoeener: 2605.45066000 hartree
kineticenergy: 1409.05662284 hartree
xcener: -115.515247675431 hartree
chargesum: 1.0000000
charge: -0.029878 0.073738 -0.056961 -0.268596 0.051307 0.801957 -0.238365 -0.194349 -0.287213 -0.106466 0.114005 -0.500831 -0.124341 -0.264299 -0.214850 -0.259778 -0.096999 -0.126870 0.188595 -0.105625 -0.184046 -0.075380 0.187612 0.059041 0.110035 0.129474 0.095547 0.172666 0.123003 0.114014 0.149905 0.126081 0.238816 0.125242 0.156308 0.155431 0.180277 0.157362 0.151676 0.141453 0.189315 0.141986
qa: -0.0299 0.0737 -0.0570 -0.2686 0.0513 0.8020 -0.2384 -0.1943 -0.2872 -0.1065 0.1140 -0.5008 -0.1243 -0.2643 -0.2149 -0.2598 -0.0970 -0.1269 0.1886 -0.1056 -0.1840 -0.0754 0.1876 0.0590 0.1100 0.1295 0.0955 0.1727 0.1230 0.1140 0.1499 0.1261 0.2388 0.1252 0.1563 0.1554 0.1803 0.1574 0.1517 0.1415 0.1893 0.1420
va: 1.2801 3.3861 3.4596 3.0745 3.0530 3.1844 3.9058 3.8742 3.5779 3.8138 3.4644 3.9860 3.9343 3.9973 3.8983 4.0068 3.9541 3.9998 3.9822 3.9476 3.9264 3.9331 3.9554 3.9780 1.0016 1.0082 1.0767 0.9926 1.0052 1.0088 1.0166 1.0243 0.9873 1.0140 0.9977 0.9984 0.9889 0.9953 1.0060 1.0070 0.9786 1.0143
dispersion: -0.025889692 hartree
energy: -1413.899689945459 hartree
dipole: 22.00265 -18.98046 3.02219 -8.89057 9.92461 1.03404 1.18013 0.58816 1.76829
magnitude: 3.65099 au
magnitude: 9.28008 debye
