program: Orca
programVersion: 5.0.2
elementType: Cl N N N N C C C C C C C C C C C C C C C C C C C H H H H H H H H H H H H H H H H H H
charge: 1
multiplicity: 1
keywords: wb97x-d3
keywords: def2-TZVPP
keywords: def2/J RIJCOSX
keywords: DEFGRID2
keywords: scfconv7
keywords: smallprint printgap noloewdin
keywords: NOSOSCF
formula: C19H18ClN4
InChI: InChI=1/C19H18ClN4/c20-18-8-6-16(7-9-18)10-11-19(12-21,13-24-15-22-14-23-24)17-4-2-1-3-5-17/h1-9,14-15,23H,10-11,13H2
42 atoms
Cl 3.856781 -2.088499 -2.980902
N  -2.293584 2.292594 1.479796
N  -2.205876 2.929791 0.306635
N  -4.312803 2.849177 0.845031
N  -2.862917 -1.238978 2.120514
C  -0.801921 0.294382 1.629025
C  0.370328 -0.219824 2.499032
C  -1.164428 1.697188 2.171056
C  -0.496773 0.376328 0.138454
C  0.848617 -1.643735 2.212758
C  1.613029 -1.801544 0.92852
C  -1.953118 -0.576011 1.879039
C  0.65322 1.04683 -0.274923
C  -1.354603 -0.143391 -0.823041
C  1.058007 -2.454657 -0.165634
C  2.891861 -1.265262 0.798497
C  0.9472 1.173332 -1.622648
C  -1.06134 -0.012487 -2.1746
C  -3.585185 2.252122 1.77411
C  0.090749 0.64195 -2.579082
C  1.739845 -2.550081 -1.370038
C  3.591578 -1.350691 -0.394724
C  -3.430355 3.258821 -0.052755
C  3.001763 -1.98895 -1.474831
H  0.045963 -0.167363 3.540582
H  1.19887 0.484358 2.403668
H  -1.439198 1.647912 3.222886
H  -0.309631 2.365193 2.07403
H  0.004015 -2.336263 2.234032
H  1.491181 -1.928176 3.048729
H  1.332527 1.473894 0.452104
H  -2.259724 -0.66403 -0.537178
H  -1.315234 3.093929 -0.156557
H  3.350946 -0.758048 1.639017
H  1.848688 1.689643 -1.925295
H  -1.738678 -0.427466 -2.908999
H  -3.953281 1.794347 2.678676
H  0.321475 0.742047 -3.631405
H  1.286962 -3.052321 -2.2142
H  4.58081 -0.921306 -0.479246
H  -3.638227 3.796113 -0.963832
H  0.067097 -2.885083 -0.087385
elementType: Cl N C H
totalener: -1413.97584677 hartree
nucrepener: 2180.10583061 hartree
electener: -3594.08167738 hartree
oneelecener: -6236.67147390 hartree
twoeener: 2642.58979652 hartree
cpcmener: -0.13584165 hartree
kineticenergy: 1409.02100124 hartree
xcener: -115.511199981686 hartree
chargesum: 1.0000000
charge: -0.106107 0.077643 -0.021048 -0.362006 -0.070256 0.800173 -0.216696 -0.111047 -0.359790 -0.092570 0.084415 -0.381337 -0.182115 -0.109611 -0.185221 -0.235603 -0.172418 -0.142747 0.168831 -0.137770 -0.177845 -0.139462 0.198738 0.097499 0.123550 0.121259 0.161768 0.174017 0.095567 0.112772 0.142205 0.132360 0.255968 0.139484 0.159830 0.160286 0.205705 0.160577 0.142083 0.142795 0.205433 0.140690
qa: -0.1061 0.0776 -0.0210 -0.3620 -0.0703 0.8002 -0.2167 -0.1110 -0.3598 -0.0926 0.0844 -0.3813 -0.1821 -0.1096 -0.1852 -0.2356 -0.1724 -0.1427 0.1688 -0.1378 -0.1778 -0.1395 0.1987 0.0975 0.1236 0.1213 0.1618 0.1740 0.0956 0.1128 0.1422 0.1324 0.2560 0.1395 0.1598 0.1603 0.2057 0.1606 0.1421 0.1428 0.2054 0.1407
va: 1.1979 3.3998 3.5051 3.0453 3.1064 3.3618 3.8993 3.7778 3.5994 3.8530 3.5004 4.1327 3.8977 3.7744 3.9235 3.9617 3.8751 3.8954 3.9885 3.8536 3.9365 3.9495 3.9448 3.7664 1.0096 1.0006 1.0004 0.9867 1.0153 0.9996 1.0131 1.0201 0.9639 1.0043 0.9928 0.9908 0.9784 0.9890 1.0075 1.0051 0.9729 1.0029
dispersion: -0.028146597 hartree
energy: -1414.003993364843 hartree
dipole: -4.86349 2.94346 -1.92003 7.17013 -1.32414 5.84599 11.59636 -9.25260 2.34376
magnitude: 6.58448 au
magnitude: 16.73641 debye
