program: Orca
programVersion: 5.0.2
elementType: Cl N N N N C C C C C C C C C C C C C C C C C C C H H H H H H H H H H H H H H H H H H
charge: 1
multiplicity: 1
keywords: wb97x-d3
keywords: def2-TZVPP
keywords: def2/J RIJCOSX
keywords: DEFGRID2
keywords: scfconv7
keywords: smallprint printgap noloewdin
keywords: NOSOSCF
formula: C19H18ClN4
InChI: InChI=1/C19H18ClN4/c20-18-8-6-16(7-9-18)10-11-19(12-21,13-24-15-22-14-23-24)17-4-2-1-3-5-17/h1-9,14-15,22H,10-11,13H2
42 atoms
Cl -5.47863 -0.305833 -0.096657
N  -0.056275 1.573648 -0.456532
N  -0.609522 2.417916 0.43089
N  -2.12162 1.610671 -0.908602
N  0.92433 -1.553829 -2.007967
C  1.82114 -0.083441 -0.046182
C  1.247888 -0.547853 1.333683
C  1.387866 1.351122 -0.434459
C  3.351792 -0.045232 -0.031349
C  0.209972 -1.677869 1.338772
C  -1.198455 -1.317388 0.944099
C  1.350479 -0.950541 -1.126556
C  4.124085 -0.671103 -1.000459
C  3.984563 0.672339 0.982752
C  -1.8168 -1.880183 -0.170616
C  -1.959752 -0.479866 1.759642
C  5.509401 -0.586973 -0.951203
C  5.365195 0.758197 1.026869
C  -0.963488 1.069218 -1.266941
C  6.132441 0.126275 0.058296
C  -3.136979 -1.590366 -0.487868
C  -3.282128 -0.189471 1.465604
C  -1.869485 2.426977 0.14823
C  -3.860639 -0.734349 0.327566
H  0.853563 0.320914 1.867551
H  2.094297 -0.896947 1.922821
H  1.775775 2.0617 0.290783
H  1.795309 1.612072 -1.410987
H  0.181498 -2.057205 2.363236
H  0.566931 -2.515206 0.736395
H  3.664965 -1.239764 -1.798917
H  3.406827 1.163273 1.758079
H  -1.268095 -2.567149 -0.80193
H  -1.525766 -0.066593 2.663151
H  6.099048 -1.087863 -1.706781
H  5.842183 1.315482 1.821507
H  -0.800473 0.369222 -2.070957
H  7.211377 0.18887 0.094408
H  -3.603001 -2.046984 -1.351006
H  -3.865867 0.43816 2.126357
H  -2.620084 2.999771 0.666333
H  -3.027058 1.38451 -1.299701
totalener: -1413.88425883 hartree
nucrepener: 2163.85640397 hartree
electener: -3577.74066280 hartree
oneelecener: -6204.78562669 hartree
twoeener: 2627.04496389 hartree
kineticenergy: 1409.06323171 hartree
xcener: -115.515970775456 hartree
chargesum: 1.0000000
charge: -0.027489 0.135881 -0.236800 -0.095802 -0.004754 0.749062 -0.269667 -0.188644 -0.096162 -0.113593 0.071402 -0.483084 -0.163427 -0.269213 -0.146150 -0.220973 -0.100275 -0.124875 0.113929 -0.111611 -0.139252 -0.146237 0.140008 -0.016247 0.106285 0.129472 0.155125 0.173416 0.128175 0.119903 0.140242 0.134030 0.152400 0.133175 0.146305 0.144893 0.225379 0.148058 0.151538 0.146651 0.189009 0.219916
qa: -0.0275 0.1359 -0.2368 -0.0958 -0.0048 0.7491 -0.2697 -0.1886 -0.0962 -0.1136 0.0714 -0.4831 -0.1634 -0.2692 -0.1462 -0.2210 -0.1003 -0.1249 0.1139 -0.1116 -0.1393 -0.1462 0.1400 -0.0162 0.1063 0.1295 0.1551 0.1734 0.1282 0.1199 0.1402 0.1340 0.1524 0.1332 0.1463 0.1449 0.2254 0.1481 0.1515 0.1467 0.1890 0.2199
va: 1.2860 3.4060 2.8609 3.5420 3.0198 3.2486 3.9282 3.8427 3.6887 3.8124 3.3915 3.9231 3.9792 4.0406 3.8674 3.8679 3.9799 4.0258 3.9472 3.9806 3.9096 3.8590 3.9407 3.9004 1.0022 1.0057 1.0037 0.9947 0.9978 1.0080 1.0143 1.0043 1.0060 1.0122 0.9993 0.9990 0.9833 0.9962 1.0067 1.0070 0.9834 0.9903
dispersion: -0.027423650 hartree
energy: -1413.911682477908 hartree
dipole: 23.38522 -23.58573 -0.20050 0.17105 1.87256 2.04362 5.26337 -5.39004 -0.12667
magnitude: 2.05733 au
magnitude: 5.22932 debye
