program: Orca
programVersion: 5.0.2
elementType: Cl N N N N C C C C C C C C C C C C C C C C C C C H H H H H H H H H H H H H H H H H H
charge: 1
multiplicity: 1
keywords: wb97x-d3
keywords: def2-TZVPP
keywords: def2/J RIJCOSX
keywords: DEFGRID2
keywords: scfconv7
keywords: smallprint printgap noloewdin
keywords: NOSOSCF
formula: C19H18ClN4
InChI: InChI=1/C19H18ClN4/c20-18-8-6-16(7-9-18)10-11-19(12-21,13-24-15-22-14-23-24)17-4-2-1-3-5-17/h1-9,14-15,22H,10-11,13H2
42 atoms
Cl -5.32938 0.031847 0.89236
N  0.164557 1.450649 -0.82691
N  1.017908 2.438025 -1.134019
N  -0.433751 2.140795 -2.731822
N  0.617243 -1.600116 -2.07114
C  1.339516 -0.503268 0.18485
C  1.223358 -1.506676 1.368161
C  0.316208 0.651231 0.37617
C  2.758438 0.053597 0.097733
C  0.092623 -2.54181 1.308663
C  -1.294124 -1.965487 1.225857
C  0.971547 -1.164362 -1.067276
C  3.264507 0.767381 1.181711
C  3.573398 -0.159999 -1.006013
C  -2.045596 -2.061802 0.05796
C  -1.846829 -1.280404 2.306658
C  4.555987 1.263883 1.158169
C  4.869758 0.336718 -1.027833
C  -0.71465 1.252633 -1.784245
C  5.363751 1.050528 0.050103
C  -3.289581 -1.454689 -0.049549
C  -3.085392 -0.666212 2.215313
C  0.643756 2.854998 -2.297391
C  -3.798314 -0.743039 1.026659
H  1.152145 -0.923855 2.290401
H  2.17179 -2.041505 1.425592
H  -0.668075 0.267371 0.631057
H  0.641037 1.316917 1.171936
H  0.183842 -3.155358 2.208281
H  0.26322 -3.220168 0.47056
H  2.661276 0.937181 2.066105
H  3.2182 -0.725815 -1.85776
H  -1.662332 -2.626556 -0.782695
H  -1.303889 -1.222418 3.24337
H  4.933964 1.813705 2.009301
H  5.494347 0.155806 -1.892088
H  -1.503518 0.515821 -1.785934
H  6.374554 1.434433 0.032521
H  -3.873114 -1.560133 -0.954713
H  -3.500888 -0.142045 3.065072
H  1.106294 3.655539 -2.850426
H  -0.927765 2.250105 -3.606747
totalener: -1413.88620811 hartree
nucrepener: 2140.65947590 hartree
electener: -3554.54568401 hartree
oneelecener: -6159.39210150 hartree
twoeener: 2604.84641748 hartree
kineticenergy: 1409.07339930 hartree
xcener: -115.515504938512 hartree
chargesum: 1.0000000
charge: -0.035654 0.144293 -0.234664 -0.114645 0.013272 0.833542 -0.254339 -0.216984 -0.211494 -0.106950 0.127283 -0.502207 -0.203635 -0.132365 -0.247113 -0.252510 -0.146901 -0.114229 0.153910 -0.097964 -0.183186 -0.075426 0.155766 0.060812 0.108048 0.128055 0.133897 0.159903 0.121683 0.112150 0.116513 0.140836 0.146227 0.125589 0.143560 0.144426 0.219522 0.147285 0.151292 0.140921 0.190346 0.211134
qa: -0.0357 0.1443 -0.2347 -0.1146 0.0133 0.8335 -0.2543 -0.2170 -0.2115 -0.1070 0.1273 -0.5022 -0.2036 -0.1324 -0.2471 -0.2525 -0.1469 -0.1142 0.1539 -0.0980 -0.1832 -0.0754 0.1558 0.0608 0.1080 0.1281 0.1339 0.1599 0.1217 0.1122 0.1165 0.1408 0.1462 0.1256 0.1436 0.1444 0.2195 0.1473 0.1513 0.1409 0.1903 0.2111
va: 1.2733 3.4087 2.8997 3.5639 3.0392 3.1562 3.9081 3.8773 3.5777 3.8070 3.4425 3.9838 4.0440 3.8910 3.9164 3.9933 4.0470 3.9865 3.9329 3.9583 3.9274 3.9345 3.9147 3.9795 1.0016 1.0106 1.0441 1.0102 1.0052 1.0076 1.0156 1.0137 1.0135 1.0124 0.9995 0.9998 0.9827 0.9959 1.0055 1.0063 0.9803 0.9909
dispersion: -0.025310581 hartree
energy: -1413.911518692640 hartree
dipole: 21.00954 -20.37159 0.63795 -2.62671 5.14348 2.51677 3.08036 -4.83650 -1.75614
magnitude: 3.13451 au
magnitude: 7.96729 debye
