program: Orca
programVersion: 5.0.2
elementType: Cl N N N N C C C C C C C C C C C C C C C C C C C H H H H H H H H H H H H H H H H H H
charge: 1
multiplicity: 1
keywords: wb97x-d3
keywords: def2-TZVPP
keywords: def2/J RIJCOSX
keywords: DEFGRID2
keywords: scfconv7
keywords: smallprint printgap noloewdin
keywords: NOSOSCF
formula: C19H18ClN4
InChI: InChI=1/C19H18ClN4/c20-18-8-6-16(7-9-18)10-11-19(12-21,13-24-15-22-14-23-24)17-4-2-1-3-5-17/h1-9,14-15,22H,10-11,13H2
42 atoms
Cl -0.759313 -4.680722 -1.007153
N  0.974891 3.293267 -0.370866
N  2.292597 3.08808 -0.511507
N  1.421942 3.802767 -2.372891
N  -2.32521 2.107633 -0.935179
C  -0.420582 1.574956 0.770186
C  -1.007466 1.246335 2.166849
C  0.306048 2.941206 0.875923
C  0.546024 0.513877 0.252123
C  -2.149565 0.224731 2.169626
C  -1.851356 -1.043574 1.418767
C  -1.514397 1.805009 -0.177331
C  1.688346 0.228346 0.995689
C  0.328553 -0.171788 -0.935057
C  -2.571307 -1.378692 0.279406
C  -0.824532 -1.891155 1.825598
C  2.584243 -0.736431 0.570032
C  1.220252 -1.148999 -1.354852
C  0.431758 3.723679 -1.489418
C  2.348367 -1.435413 -0.604953
C  -2.255778 -2.50667 -0.464502
C  -0.490435 -3.01404 1.092296
C  2.556975 3.401271 -1.735427
C  -1.202958 -3.308718 -0.061754
H  -1.374727 2.16842 2.626886
H  -0.183674 0.897502 2.791485
H  -0.391368 3.738387 1.132298
H  1.08086 2.905781 1.638038
H  -3.048999 0.688982 1.759268
H  -2.380454 0.004083 3.214782
H  1.890608 0.744025 1.927387
H  -0.559608 0.01136 -1.525441
H  -3.390077 -0.748588 -0.046529
H  -0.260704 -1.670438 2.724457
H  3.462068 -0.950304 1.164719
H  1.016051 -1.701565 -2.261866
H  -0.607309 3.957853 -1.66048
H  3.036282 -2.204819 -0.927992
H  -2.824203 -2.755462 -1.35009
H  0.318326 -3.656689 1.410809
H  3.531452 3.358217 -2.192732
H  1.333842 4.103892 -3.333839
totalener: -1413.88210000 hartree
nucrepener: 2215.05182000 hartree
electener: -3628.93392000 hartree
oneelecener: -6309.04876919 hartree
twoeener: 2680.11484919 hartree
kineticenergy: 1409.09889558 hartree
xcener: -115.523386911262 hartree
chargesum: 1.0000000
charge: -0.056095 0.129567 -0.218518 -0.114732 0.022416 0.841380 -0.227818 -0.196683 -0.210908 -0.133784 0.087622 -0.525457 -0.249594 -0.149276 -0.189784 -0.173901 -0.116343 -0.132060 0.155443 -0.108946 -0.108161 -0.134369 0.153302 0.070845 0.105450 0.122265 0.164283 0.162008 0.109267 0.119995 0.106922 0.144580 0.122211 0.109533 0.144902 0.146040 0.218792 0.148023 0.131201 0.126333 0.191165 0.212881
qa: -0.0561 0.1296 -0.2185 -0.1147 0.0224 0.8414 -0.2278 -0.1967 -0.2109 -0.1338 0.0876 -0.5255 -0.2496 -0.1493 -0.1898 -0.1739 -0.1163 -0.1321 0.1554 -0.1089 -0.1082 -0.1344 0.1533 0.0708 0.1055 0.1223 0.1643 0.1620 0.1093 0.1200 0.1069 0.1446 0.1222 0.1095 0.1449 0.1460 0.2188 0.1480 0.1312 0.1263 0.1912 0.2129
va: 1.2518 3.4489 2.8975 3.5637 3.0459 3.1181 3.8825 3.8469 3.6478 3.8192 3.5366 4.0376 4.0357 3.8086 3.9419 3.9911 3.9904 3.9408 3.9262 3.9417 3.9774 3.9307 3.9214 3.9163 1.0166 0.9967 1.0003 0.9961 1.0090 1.0041 1.0219 1.0079 1.0116 1.0100 0.9963 1.0022 0.9832 0.9959 1.0102 1.0128 0.9805 0.9897
dispersion: -0.028681625 hartree
energy: -1413.910781621035 hartree
dipole: 2.58551 -0.19601 2.38950 14.53160 -8.99917 5.53243 8.90649 -10.20489 -1.29839
magnitude: 6.16468 au
magnitude: 15.66937 debye
