program: Orca
programVersion: 5.0.2
elementType: Cl N N N N C C C C C C C C C C C C C C C C C C C H H H H H H H H H H H H H H H H H H
charge: 1
multiplicity: 1
keywords: wb97x-d3
keywords: def2-TZVPP
keywords: def2/J RIJCOSX
keywords: DEFGRID2
keywords: scfconv7
keywords: smallprint printgap noloewdin
keywords: NOSOSCF
formula: C19H18ClN4
InChI: InChI=1/C19H18ClN4/c20-18-8-6-16(7-9-18)10-11-19(12-21,13-24-15-22-14-23-24)17-4-2-1-3-5-17/h1-9,14-15,22H,10-11,13H2
42 atoms
Cl -4.97379 -0.516893 2.13493
N  0.010577 1.621829 -1.507063
N  0.136102 2.599234 -0.596062
N  0.29645 3.403134 -2.611441
N  1.936012 -0.284689 -3.59953
C  1.16912 -0.562978 -1.113857
C  0.906509 -2.080152 -0.881792
C  -0.160678 0.231391 -1.088778
C  2.226923 -0.029941 -0.15517
C  0.474657 -2.501503 0.521409
C  -0.89053 -2.025279 0.94025
C  1.647447 -0.435309 -2.496176
C  1.883338 0.547653 1.062834
C  3.574733 -0.203251 -0.45851
C  -2.018736 -2.326562 0.179532
C  -1.066014 -1.275892 2.099114
C  2.867336 0.952663 1.952576
C  4.556723 0.199216 0.432355
C  0.103916 2.093532 -2.731719
C  4.206234 0.780315 1.641233
C  -3.27469 -1.868436 0.539893
C  -2.316886 -0.808349 2.47553
C  0.312542 3.680672 -1.277662
C  -3.417961 -1.098652 1.685902
H  1.840396 -2.593083 -1.118787
H  0.179674 -2.424802 -1.622633
H  -0.884002 -0.233582 -1.757681
H  -0.608218 0.257977 -0.099896
H  1.223692 -2.186944 1.250096
H  0.49304 -3.594606 0.534101
H  0.849822 0.692763 1.344822
H  3.87466 -0.654679 -1.396887
H  -1.927862 -2.946919 -0.705043
H  -0.213242 -1.061722 2.732376
H  2.581574 1.402486 2.893862
H  5.598152 0.05609 0.178713
H  0.04334 1.534743 -3.651757
H  4.972257 1.095071 2.336601
H  -4.141406 -2.119609 -0.056031
H  -2.435391 -0.232682 3.383232
H  0.448257 4.664911 -0.861035
H  0.412428 4.056009 -3.374558
totalener: -1413.88362199 hartree
nucrepener: 2132.56017152 hartree
electener: -3546.44379352 hartree
oneelecener: -6143.48742074 hartree
twoeener: 2597.04362723 hartree
kineticenergy: 1409.07018266 hartree
xcener: -115.515068069816 hartree
chargesum: 1.0000000
charge: -0.039527 0.165987 -0.237316 -0.122144 0.003904 0.538295 -0.204152 -0.268769 0.007782 -0.143195 0.074646 -0.341416 -0.309160 -0.181651 -0.227697 -0.244297 -0.093377 -0.116765 0.152999 -0.123030 -0.110928 -0.085412 0.155090 0.053836 0.125984 0.120008 0.168426 0.160913 0.113093 0.128316 0.136641 0.135789 0.129273 0.136161 0.143602 0.147258 0.220875 0.148396 0.139339 0.137189 0.191944 0.213092
qa: -0.0395 0.1660 -0.2373 -0.1221 0.0039 0.5383 -0.2042 -0.2688 0.0078 -0.1432 0.0746 -0.3414 -0.3092 -0.1817 -0.2277 -0.2443 -0.0934 -0.1168 0.1530 -0.1230 -0.1109 -0.0854 0.1551 0.0538 0.1260 0.1200 0.1684 0.1609 0.1131 0.1283 0.1366 0.1358 0.1293 0.1362 0.1436 0.1473 0.2209 0.1484 0.1393 0.1372 0.1919 0.2131
va: 1.2672 3.4379 2.9070 3.5642 3.0569 3.5859 3.8936 3.8873 3.5456 3.8652 3.4728 3.9364 3.9812 4.0283 3.9748 3.9693 3.9983 3.9821 3.9423 3.9898 3.9716 3.9681 3.9239 4.0112 1.0142 1.0041 0.9990 1.0120 1.0002 0.9998 1.0135 1.0078 1.0095 1.0035 0.9984 0.9981 0.9763 0.9955 1.0081 1.0088 0.9796 0.9899
dispersion: -0.024962334 hartree
energy: -1413.908584326740 hartree
dipole: 18.28498 -17.37131 0.91367 -3.25754 6.62484 3.36731 -2.86571 0.41029 -2.45542
magnitude: 4.26645 au
magnitude: 10.84446 debye
