program: Orca
programVersion: 5.0.2
elementType: Cl N N N N C C C C C C C C C C C C C C C C C C C H H H H H H H H H H H H H H H H H H
charge: 1
multiplicity: 1
keywords: wb97x-d3
keywords: def2-TZVPP
keywords: def2/J RIJCOSX
keywords: DEFGRID2
keywords: scfconv7
keywords: smallprint printgap noloewdin
keywords: NOSOSCF
formula: C19H18ClN4
InChI: InChI=1/C19H18ClN4/c20-18-8-6-16(7-9-18)10-11-19(12-21,13-24-15-22-14-23-24)17-4-2-1-3-5-17/h1-9,14-15,22H,10-11,13H2
42 atoms
Cl -5.308816 -0.095507 1.57423
N  0.318709 1.548342 -0.717238
N  -0.650869 1.648646 -1.639186
N  0.885251 3.153763 -1.971417
N  0.540141 -1.508899 -2.479024
C  1.266167 -0.665172 -0.115443
C  1.195449 -1.830449 0.910417
C  0.279212 0.469149 0.264057
C  2.675421 -0.080212 -0.162843
C  0.009754 -2.792666 0.793873
C  -1.339392 -2.159282 0.992333
C  0.87204 -1.154174 -1.43762
C  3.233389 0.420098 1.014769
C  3.402012 0.024309 -1.344024
C  -2.225671 -2.006407 -0.06931
C  -1.721031 -1.68139 2.244455
C  4.482319 1.020609 1.006865
C  4.65672 0.623022 -1.349618
C  1.260582 2.447584 -0.908267
C  5.197437 1.128831 -0.17944
C  -3.447757 -1.37227 0.101783
C  -2.937747 -1.047287 2.431977
C  -0.29821 2.629891 -2.399422
C  -3.796512 -0.888912 1.352768
H  1.225616 -1.398162 1.913803
H  2.117239 -2.403286 0.799418
H  -0.751313 0.126003 0.292981
H  0.534848 0.875203 1.240969
H  0.165629 -3.569876 1.546165
H  0.045295 -3.304296 -0.169698
H  2.704748 0.33618 1.957093
H  3.006487 -0.372965 -2.270233
H  -1.963138 -2.383701 -1.050085
H  -1.065807 -1.816646 3.097892
H  4.903408 1.393235 1.930991
H  5.213227 0.681857 -2.275389
H  2.151334 2.59196 -0.316645
H  6.17589 1.589455 -0.184582
H  -4.127451 -1.264332 -0.732136
H  -3.225845 -0.6915 3.411656
H  -0.853819 2.990053 -3.249356
H  1.392039 3.928691 -2.376213
totalener: -1413.88502506 hartree
nucrepener: 2132.94993673 hartree
electener: -3546.83496179 hartree
oneelecener: -6144.13588109 hartree
twoeener: 2597.30091929 hartree
kineticenergy: 1409.06380150 hartree
xcener: -115.512595146507 hartree
chargesum: 1.0000000
charge: -0.043530 0.133887 -0.216601 -0.113849 0.051280 0.802130 -0.233875 -0.188797 -0.257105 -0.111408 0.067132 -0.512758 -0.242708 -0.138112 -0.197726 -0.245181 -0.145913 -0.115328 0.134830 -0.102698 -0.104082 -0.091974 0.159608 0.047839 0.102527 0.126387 0.155939 0.161971 0.121551 0.112090 0.127998 0.151200 0.130493 0.121863 0.153003 0.155396 0.216737 0.155686 0.134940 0.136132 0.191985 0.209040
qa: -0.0435 0.1339 -0.2166 -0.1138 0.0513 0.8021 -0.2339 -0.1888 -0.2571 -0.1114 0.0671 -0.5128 -0.2427 -0.1381 -0.1977 -0.2452 -0.1459 -0.1153 0.1348 -0.1027 -0.1041 -0.0920 0.1596 0.0478 0.1025 0.1264 0.1559 0.1620 0.1216 0.1121 0.1280 0.1512 0.1305 0.1219 0.1530 0.1554 0.2167 0.1557 0.1349 0.1361 0.1920 0.2090
va: 1.2632 3.4537 2.9008 3.5510 3.0667 3.2739 3.9152 3.8356 3.5420 3.8182 3.5205 4.0289 4.0170 3.8696 3.9497 4.0061 4.0105 3.9577 3.9359 3.9340 3.9824 3.9566 3.9073 3.9977 1.0025 1.0084 1.0439 0.9940 1.0037 1.0095 1.0212 1.0204 1.0157 1.0135 0.9993 0.9971 0.9791 0.9953 1.0098 1.0084 0.9793 0.9917
dispersion: -0.025156485 hartree
energy: -1413.910181549919 hartree
dipole: 23.77181 -20.63380 3.13801 -1.38786 5.37303 3.98517 1.10977 -1.98900 -0.87923
magnitude: 5.14798 au
magnitude: 13.08514 debye
