program: Gaussian 09
title: 000070945
version: EM64L-G09RevD.01
frameworkgroup: C1[X(C7H10O2)]
method: RPBEPBE
basis: SDD
operation: Freq
keyword: #pfreq=noraman
keyword: PBEPBE/SDD
title: #p freq=noraman PBEPBE/SDD
converged: NO YES NO NO
title: Mulliken charges:
elementType: O O C C C C C C C H H H H H H H H H H
charge: -0.186378 -0.186314 -0.287547 -0.408048 -0.504725 -0.504624 0.171727 0.171404 -0.710222 0.291102 0.232497 0.233491 0.259781 0.225070 0.224954 0.259783 0.251379 0.215237 0.251432
chargesum: 0.00000
title: Mulliken charges with hydrogens summed into heavy atoms:
elementType: O O C C C C C C C
charge: -0.186378 -0.186314 0.003555 0.057940 -0.019874 -0.019886 0.171727 0.171404 0.007827
polarizability: 8.76012343e+01 -8.77940477e-03 7.74359239e+01 2.01597477e-03 3.12477810e+00 6.52248116e+01
1716.lowfreq: -29.6437 -11.1532 -0.0009 -0.0007 -0.0004 11.8914 56.2756 81.3752 181.2663
frequency: 56.2566 81.3194 181.2660 214.8691 221.5259 249.8073 380.8901 381.0945 424.7345 510.1664 529.1869 616.6969 667.5525 728.9683 787.4074 857.3159 885.7197 892.6511 976.4248 994.6260 996.0358 1060.5693 1084.3656 1116.7051 1132.1564 1211.8227 1229.8684 1262.0233 1268.3034 1277.1071 1303.3576 1306.9806 1341.0365 1381.3131 1437.7864 1446.4185 1475.7822 1476.8110 1477.0954 1616.4553 1642.3995 2974.9921 2976.4430 2990.5787 3001.4606 3044.3117 3062.9384 3078.7245 3082.4207 3094.0572 3096.8571
redmass: 5.3293 3.5814 3.0517 2.4371 1.0612 2.5197 5.4015 3.9692 2.6804 4.4476 2.5464 3.5903 4.0291 2.3443 2.7607 1.5836 1.7966 2.7308 2.8940 1.4221 1.7835 1.8192 2.2963 1.4834 1.8651 2.0236 1.7017 1.8839 1.4542 1.2350 1.6385 1.2775 1.4373 1.1894 1.0860 1.0842 1.0601 1.0687 1.0525 8.8412 10.4956 1.0659 1.0657 1.0341 1.0610 1.0852 1.1013 1.0949 1.0972 1.1001 1.1014
irintensity: 7.8341 0.1272 1.4158 1.1385 0.0074 1.1389 13.7731 9.7395 0.0342 4.1485 3.3951 3.5374 1.6858 7.7045 3.7866 0.0002 23.5272 1.7833 4.7665 45.2446 1.9272 5.9487 6.7937 11.2691 9.0193 35.1499 27.6753 49.1800 0.5324 1.4701 22.6156 0.2931 5.6908 9.4822 19.7770 16.6294 11.9963 23.4046 6.6041 269.1975 116.8830 11.8830 6.3863 23.7058 33.7319 1.7682 24.5680 17.1032 21.5564 26.6930 9.5811
temp: 298.150 k
press: 1.00000 atm
elementType: 8 8 6 6 6 6 6 6 6 1 1 1 1 1 1 1 1 1 1
symmnumber: 1
zpe: 410233.3 jmol-1
zpe.correction: 0.156250 hartree
zpe.thermalcorrener: 0.165177 hartree
zpe.thermalcorrenthalpy: 0.166121 hartree
zpe.thermalcorrgfe: 0.122172 hartree
zpe.sumelectzpe: -422.490207 hartree
zpe.sumelectthermal: -422.481280 hartree
zpe.sumelectthermalent: -422.480336 hartree
zpe.sumelectthermalfe: -422.524284 hartree
dipole: 0.0017 2.2265 3.4757
dipole: 4.1277
quadrupole: -68.2024 -49.5015 -54.3747
quadrupole: 0.0187 0.0008 -2.6224
quadrupole: -10.8428 7.8580 2.9848 0.0187 0.0008 -2.6224
hfenergy: -422.6464566 hartree
pointgroup: C01 [X(C7H10O2)]
dipole: -0.0001224 -0.8685957 1.3721405 debye
dipolederiv: -0.8834711 -0.0631621 0.2366054 -0.094744 -0.5066354 0.1267855 0.3660499 0.1700332 -0.4435497 -0.8826339 0.0631254 -0.2360516 0.0942003 -0.5065293 0.1264815 -0.3677453 0.170724 -0.4439182 -0.6324004 -0.0000929 -0.0002527 0.0008144 -0.2696335 -0.1154093 0.0009346 -0.1057021 -0.08537 0.1548508 -0.0003503 0.0000319 -0.0000336 0.1053975 0.0239738 -0.0001582 0.0653016 0.1387497 -0.0773988 -0.0200014 0.0302529 -0.0642496 -0.2801265 0.1795223 0.0461937 0.1922627 0.0270575 -0.0775288 0.0202557 -0.0305432 0.0640958 -0.2805801 0.1795928 -0.0462651 0.1911343 0.0277784 1.0920413 -0.1711198 -0.3890273 -0.1926419 0.7754782 -0.2866279 -0.4554805 -0.3638808 0.3441854 1.091326 0.1709506 0.3888486 0.1924091 0.7753389 -0.2866224 0.4561317 -0.3641966 0.3437901 0.0248611 0.0002208 0.0001609 -0.00003 0.119306 -0.0027422 -0.0000477 0.0945702 0.1406651 0.026062 -0.0000636 -0.0000626 -0.0000555 -0.009344 0.0581572 -0.0000385 0.0775585 -0.0091814 0.0294193 0.0000986 0.000033 0.0000619 0.0716325 -0.0294466 0.0000895 -0.104474 -0.1215435 0.0454436 0.0000853 -0.0000246 0.0000035 -0.1363803 0.0843323 0.0001094 0.1132035 0.0416168 -0.0825182 0.0793265 0.0280259 0.0575123 0.0126105 -0.0037868 0.0479857 -0.034957 0.0905484 0.1076765 -0.0159278 0.0247763 -0.0331155 0.0566065 -0.0530959 -0.0214799 -0.0430967 -0.1055473 0.1076476 0.0159819 -0.0245632 0.0331286 0.0567587 -0.0529852 0.021752 -0.0428667 -0.1059426 -0.0823965 -0.0792163 -0.0281097 -0.057516 0.0125951 -0.0037564 -0.0481846 -0.0350223 0.0904456 -0.0255528 0.1225271 0.0273248 0.0846432 0.0157955 -0.0414757 0.0073793 -0.0301602 0.0619075 0.0903244 0.0000121 -0.0000565 0.0000522 -0.0281826 0.1385573 -0.0000176 0.079568 -0.0536363 -0.025752 -0.1226497 -0.0273686 -0.0845354 0.0158922 -0.0414543 -0.0072083 -0.0299996 0.0619446 unknown
polarizability: 87.6012372|0.0041662|77.4019501|0.0092224|-3.1902748|65.2587823 unknown
InChI: InChI=1S/C7H10O2/c1-5-6(8)3-2-4-7(5)9/h5H,2-4H2,1H3
charge 0 multiplicity 1
19 atoms
O  2.278501 0.617609 -0.930438
O  -2.277747 0.616997 -0.93245
C  -0.00007 1.015277 -0.167527
C  -0.000179 -1.985299 0.044579
C  1.283446 -1.186632 0.390648
C  -1.284126 -1.186851 0.390273
C  1.285593 0.179284 -0.294303
C  -1.28642 0.180041 -0.292938
C  0.000693 1.761777 1.209408
H  -0.000172 1.776688 -0.967953
H  0.000058 -2.23897 -1.032705
H  -0.000149 -2.93983 0.600791
H  2.195635 -1.730117 0.092444
H  1.328674 -1.032558 1.489008
H  -1.330223 -1.033804 1.488727
H  -2.196002 -1.730267 0.090985
H  -0.894331 2.40324 1.284013
H  0.000941 1.062188 2.063972
H  0.896077 2.402828 1.283166
