program: Orca
programVersion: 5.0.2
elementType: Cl N N N N C C C C C C C C C C C C C C C C C C C H H H H H H H H H H H H H H H H H H
charge: 1
multiplicity: 1
keywords: wb97x-d3
keywords: def2-TZVPP
keywords: def2/J RIJCOSX
keywords: DEFGRID2
keywords: scfconv7
keywords: smallprint printgap noloewdin
keywords: NOSOSCF
formula: C19H18ClN4
InChI: InChI=1/C19H18ClN4/c20-18-8-6-16(7-9-18)10-11-19(12-21,13-24-15-22-14-23-24)17-4-2-1-3-5-17/h1-9,14-15,22H,10-11,13H2
42 atoms
Cl -5.287017 -0.047627 1.549593
N  0.336459 1.585723 -0.653674
N  -0.634625 1.72961 -1.568359
N  0.910969 3.236638 -1.843326
N  0.509343 -1.39828 -2.54485
C  1.26122 -0.661835 -0.153951
C  1.181057 -1.870666 0.819552
C  0.291147 0.467386 0.281707
C  2.676298 -0.090355 -0.185112
C  -0.018796 -2.810807 0.666221
C  -1.357968 -2.164718 0.890226
C  0.853563 -1.089576 -1.492898
C  3.397656 0.055606 -1.36505
C  3.244383 0.357498 1.008725
C  -1.731339 -1.727483 2.159566
C  -2.241053 -1.955626 -0.164585
C  4.656648 0.645256 -1.353738
C  4.497301 0.949571 1.017766
C  1.284153 2.485329 -0.810859
C  5.206649 1.100745 -0.167253
C  -2.93577 -1.077725 2.371121
C  -3.450574 -1.30463 0.030392
C  -0.277178 2.738429 -2.289151
C  -3.79029 -0.86156 1.298561
H  1.221878 -1.483997 1.841028
H  2.094601 -2.449937 0.677987
H  -0.743485 0.13692 0.305834
H  0.560345 0.829412 1.272272
H  0.125749 -3.619552 1.386739
H  0.008796 -3.283938 -0.317035
H  2.99407 -0.301702 -2.304036
H  2.719978 0.239658 1.949798
H  -1.079006 -1.906909 3.007027
H  -1.985284 -2.300298 -1.159003
H  5.208763 0.737156 -2.279455
H  4.925761 1.282538 1.953545
H  2.177973 2.598837 -0.217029
H  6.187958 1.555211 -0.159588
H  -3.217662 -0.753851 3.363592
H  -4.12771 -1.152093 -0.798634
H  -0.832475 3.136436 -3.122235
H  1.422365 4.023514 -2.218216
totalener: -1413.88495636 hartree
nucrepener: 2134.95236577 hartree
electener: -3548.83732213 hartree
oneelecener: -6148.13562099 hartree
twoeener: 2599.29829886 hartree
kineticenergy: 1409.06499456 hartree
xcener: -115.512936466920 hartree
chargesum: 1.0000000
charge: -0.043592 0.134684 -0.216315 -0.113581 0.051440 0.804567 -0.234462 -0.189719 -0.256731 -0.111321 0.069812 -0.514240 -0.137024 -0.241581 -0.247581 -0.196354 -0.115777 -0.147904 0.134544 -0.102661 -0.091454 -0.105015 0.159784 0.048188 0.102579 0.126391 0.153994 0.161889 0.121674 0.111841 0.151199 0.128140 0.121820 0.130263 0.155491 0.153405 0.216114 0.155848 0.136084 0.134730 0.191736 0.209095
qa: -0.0436 0.1347 -0.2163 -0.1136 0.0514 0.8046 -0.2345 -0.1897 -0.2567 -0.1113 0.0698 -0.5142 -0.1370 -0.2416 -0.2476 -0.1964 -0.1158 -0.1479 0.1345 -0.1027 -0.0915 -0.1050 0.1598 0.0482 0.1026 0.1264 0.1540 0.1619 0.1217 0.1118 0.1512 0.1281 0.1218 0.1303 0.1555 0.1534 0.2161 0.1558 0.1361 0.1347 0.1917 0.2091
va: 1.2632 3.4528 2.9007 3.5509 3.0666 3.2701 3.9138 3.8383 3.5418 3.8186 3.5196 4.0296 3.8686 4.0164 4.0058 3.9506 3.9577 4.0106 3.9367 3.9332 3.9554 3.9828 3.9072 3.9968 1.0025 1.0086 1.0454 0.9940 1.0036 1.0095 1.0201 1.0212 1.0136 1.0160 0.9970 0.9993 0.9795 0.9952 1.0085 1.0100 0.9794 0.9917
dispersion: -0.025214425 hartree
energy: -1413.910170782168 hartree
dipole: 23.71058 -20.54010 3.17048 -1.80324 5.77116 3.96792 1.03914 -1.74855 -0.70941
magnitude: 5.12831 au
magnitude: 13.03514 debye
