program: Orca
programVersion: 5.0.2
elementType: Cl N N N N C C C C C C C C C C C C C C C C C C C H H H H H H H H H H H H H H H H H H
charge: 1
multiplicity: 1
keywords: wb97x-d3
keywords: def2-TZVPP
keywords: def2/J RIJCOSX
keywords: DEFGRID2
keywords: scfconv7
keywords: smallprint printgap noloewdin
keywords: NOSOSCF
formula: C19H18ClN4
InChI: InChI=1/C19H18ClN4/c20-18-8-6-16(7-9-18)10-11-19(12-21,13-24-15-22-14-23-24)17-4-2-1-3-5-17/h1-9,14-15,22H,10-11,13H2
42 atoms
Cl -5.385574 -3.349231 2.939925
N  1.42128 3.083635 -1.569687
N  2.45857 3.59995 -0.895186
N  2.745757 3.824694 -3.040761
N  0.419095 0.241242 -3.374689
C  0.554421 0.865212 -0.84227
C  -0.633702 0.234191 -0.080563
C  0.347552 2.399201 -0.860193
C  1.898957 0.504329 -0.22526
C  -0.574113 -1.290571 -0.014906
C  -1.767985 -1.832958 0.72047
C  0.487966 0.451343 -2.245805
C  2.878801 -0.179385 -0.933709
C  2.147715 0.860025 1.098773
C  -2.935875 -2.158778 0.039792
C  -1.744131 -1.981115 2.102889
C  4.08724 -0.502118 -0.329339
C  3.352647 0.539661 1.699343
C  1.580418 3.208103 -2.869971
C  4.328033 -0.143502 0.985713
C  -4.053318 -2.622363 0.714413
C  -2.852463 -2.442976 2.793635
C  3.262209 4.049613 -1.799981
C  -4.005227 -2.762276 2.092705
H  -1.569661 0.545443 -0.553153
H  -0.646865 0.643783 0.932576
H  -0.598836 2.658368 -1.334561
H  0.343768 2.798628 0.151141
H  0.348275 -1.602105 0.479344
H  -0.541347 -1.705344 -1.026147
H  2.70765 -0.49063 -1.956615
H  1.400849 1.384763 1.682993
H  -2.976716 -2.064693 -1.039162
H  -0.841814 -1.746299 2.655707
H  4.834442 -1.046973 -0.890264
H  3.527929 0.818405 2.729483
H  0.907243 2.87342 -3.643452
H  5.266187 -0.401578 1.457721
H  -4.952406 -2.88139 0.172816
H  -2.818773 -2.562362 3.867579
H  4.203798 4.537953 -1.610759
H  3.158412 4.072433 -3.92998
totalener: -1413.88596131 hartree
nucrepener: 2034.42231267 hartree
electener: -3448.30827398 hartree
oneelecener: -5948.05806829 hartree
twoeener: 2499.74979431 hartree
kineticenergy: 1409.07267372 hartree
xcener: -115.509357805651 hartree
chargesum: 1.0000000
charge: -0.050136 0.133835 -0.219094 -0.117658 0.021784 0.745888 -0.227176 -0.208386 -0.310045 -0.095238 0.061411 -0.447264 -0.118908 -0.196929 -0.196309 -0.200020 -0.116491 -0.121188 0.157180 -0.099143 -0.117224 -0.121448 0.151913 0.067992 0.122397 0.117917 0.168542 0.157403 0.113512 0.115755 0.146027 0.110683 0.121420 0.116986 0.148228 0.146499 0.221083 0.150501 0.130234 0.129175 0.192328 0.213966
qa: -0.0501 0.1338 -0.2191 -0.1177 0.0218 0.7459 -0.2272 -0.2084 -0.3100 -0.0952 0.0614 -0.4473 -0.1189 -0.1969 -0.1963 -0.2000 -0.1165 -0.1212 0.1572 -0.0991 -0.1172 -0.1214 0.1519 0.0680 0.1224 0.1179 0.1685 0.1574 0.1135 0.1158 0.1460 0.1107 0.1214 0.1170 0.1482 0.1465 0.2211 0.1505 0.1302 0.1292 0.1923 0.2140
va: 1.2563 3.4342 2.9003 3.5630 3.0529 3.3281 3.8340 3.8655 3.6643 3.7655 3.5751 4.0276 3.8522 4.0146 4.0234 4.0252 3.9837 4.0216 3.9337 3.9515 4.0105 4.0161 3.9210 3.9899 1.0176 1.0093 0.9978 1.0016 1.0125 1.0125 1.0105 1.0239 1.0097 1.0103 0.9988 0.9977 0.9771 0.9951 1.0104 1.0108 0.9801 0.9890
dispersion: -0.022414655 hartree
energy: -1413.908375961328 hartree
dipole: 18.47880 -14.22608 4.25271 9.84044 -4.20067 5.63977 -5.85219 2.67980 -3.17240
magnitude: 7.74317 au
magnitude: 19.68157 debye
