program: Orca
programVersion: 5.0.2
elementType: Cl N N N N C C C C C C C C C C C C C C C C C C C H H H H H H H H H H H H H H H H H H
charge: 1
multiplicity: 1
keywords: wb97x-d3
keywords: def2-TZVPP
keywords: def2/J RIJCOSX
keywords: DEFGRID2
keywords: scfconv7
keywords: smallprint printgap noloewdin
keywords: NOSOSCF
formula: C19H18ClN4
InChI: InChI=1/C19H18ClN4/c20-18-8-6-16(7-9-18)10-11-19(12-21,13-24-15-22-14-23-24)17-4-2-1-3-5-17/h1-9,14-15,22H,10-11,13H2
42 atoms
Cl -0.152512 -5.214077 0.699048
N  0.275531 3.688988 -0.972536
N  -0.24488 4.601172 -0.136025
N  -0.807361 5.035384 -2.193464
N  -1.212501 1.094993 -2.417215
C  0.164182 1.282936 -0.209745
C  -0.808475 1.494926 0.977171
C  1.034463 2.54714 -0.47091
C  1.147242 0.137613 0.023666
C  -1.972131 0.50107 1.052288
C  -1.570854 -0.946953 0.995406
C  -0.61158 1.092416 -1.435974
C  2.011636 0.208446 1.11345
C  1.211687 -0.963498 -0.819236
C  -1.971471 -1.755461 -0.059922
C  -0.764501 -1.502707 1.98477
C  2.910926 -0.814171 1.365249
C  2.101027 -1.994335 -0.55578
C  -0.060496 3.935979 -2.220117
C  2.952133 -1.92387 0.534738
C  -1.555269 -3.075888 -0.152976
C  -0.331943 -2.812372 1.903553
C  -0.903555 5.417558 -0.889606
C  -0.722457 -3.592209 0.823845
H  -1.230145 2.501688 0.938568
H  -0.215014 1.454438 1.891943
H  1.51551 2.873247 0.448139
H  1.809201 2.315588 -1.200735
H  -2.682336 0.714394 0.250179
H  -2.507857 0.707497 1.982581
H  1.983002 1.049478 1.797313
H  0.548334 -1.050732 -1.669582
H  -2.613146 -1.35274 -0.834477
H  -0.453024 -0.904832 2.833222
H  3.572387 -0.74709 2.218338
H  2.117283 -2.860587 -1.202688
H  0.211572 3.363045 -3.091777
H  3.641252 -2.731617 0.739805
H  -1.874108 -3.693579 -0.981219
H  0.305582 -3.227846 2.671221
H  -1.448368 6.281458 -0.546029
H  -1.224908 5.486546 -2.996477
totalener: -1413.88078960 hartree
nucrepener: 2169.21183959 hartree
electener: -3583.09262919 hartree
oneelecener: -6217.74682371 hartree
twoeener: 2634.65419452 hartree
kineticenergy: 1409.08099180 hartree
xcener: -115.519694778753 hartree
chargesum: 1.0000000
charge: -0.054137 0.132930 -0.255969 -0.117988 0.009469 0.794925 -0.212592 -0.189280 -0.192950 -0.135996 0.095075 -0.495095 -0.263467 -0.108640 -0.198576 -0.172464 -0.139671 -0.124871 0.153570 -0.099639 -0.101707 -0.140755 0.163852 0.073535 0.107206 0.117613 0.155114 0.176451 0.100926 0.120744 0.119210 0.133200 0.118681 0.109941 0.142464 0.142479 0.223412 0.145929 0.130829 0.126549 0.194602 0.215091
qa: -0.0541 0.1329 -0.2560 -0.1180 0.0095 0.7949 -0.2126 -0.1893 -0.1929 -0.1360 0.0951 -0.4951 -0.2635 -0.1086 -0.1986 -0.1725 -0.1397 -0.1249 0.1536 -0.0996 -0.1017 -0.1408 0.1639 0.0735 0.1072 0.1176 0.1551 0.1765 0.1009 0.1207 0.1192 0.1332 0.1187 0.1099 0.1425 0.1425 0.2234 0.1459 0.1308 0.1265 0.1946 0.2151
va: 1.2533 3.4130 2.8782 3.5594 3.0570 3.1680 3.8657 3.7861 3.6185 3.8160 3.5375 4.0425 4.0584 3.8714 3.9497 3.9878 4.0201 3.9490 3.9516 3.9452 3.9810 3.9429 3.9007 3.9235 1.0249 1.0014 1.0050 0.9924 1.0134 1.0022 1.0152 1.0089 1.0121 1.0098 0.9987 1.0027 0.9698 0.9966 1.0103 1.0130 0.9781 0.9887
dispersion: -0.027471110 hartree
energy: -1413.908260713151 hartree
dipole: 1.77333 -1.60369 0.16964 16.89401 -9.81513 7.07888 2.28462 -4.22918 -1.94456
magnitude: 7.34307 au
magnitude: 18.66459 debye
