program: Orca
programVersion: 5.0.2
elementType: Cl N N N N C C C C C C C C C C C C C C C C C C C H H H H H H H H H H H H H H H H H H
charge: 1
multiplicity: 1
keywords: wb97x-d3
keywords: def2-TZVPP
keywords: def2/J RIJCOSX
keywords: DEFGRID2
keywords: scfconv7
keywords: smallprint printgap noloewdin
keywords: NOSOSCF
formula: C19H18ClN4
InChI: InChI=1/C19H18ClN4/c20-18-8-6-16(7-9-18)10-11-19(12-21,13-24-15-22-14-23-24)17-4-2-1-3-5-17/h1-9,14-15,22H,10-11,13H2
42 atoms
Cl -5.337535 0.134051 1.465524
N  0.350818 1.449367 -0.97561
N  -0.577728 1.415357 -1.944158
N  0.976039 2.862877 -2.41891
N  0.69163 -1.780548 -2.30167
C  1.280904 -0.643667 -0.02447
C  1.163938 -1.671414 1.134722
C  0.26459 0.515605 0.143014
C  2.688125 -0.053242 -0.06317
C  -0.017751 -2.643324 1.093217
C  -1.369023 -1.992223 1.1910
C  0.966309 -1.300449 -1.294332
C  3.157753 0.636423 1.055891
C  3.50294 -0.138375 -1.186629
C  -2.239141 -1.966397 0.105712
C  -1.766671 -1.367833 2.371525
C  4.405563 1.239337 1.043435
C  4.757458 0.460656 -1.195332
C  1.302182 2.316398 -1.250596
C  5.209235 1.156986 -0.08695
C  -3.462555 -1.316012 0.18263
C  -2.983619 -0.714115 2.46436
C  -0.188857 2.279758 -2.819721
C  -3.826245 -0.684609 1.36156
H  1.157048 -1.117248 2.076771
H  2.08824 -2.251139 1.132309
H  -0.763168 0.163417 0.160469
H  0.456876 1.056557 1.067843
H  0.117801 -3.334127 1.929066
H  0.039986 -3.256917 0.192196
H  2.559565 0.702316 1.957416
H  3.177373 -0.685519 -2.062179
H  -1.961924 -2.457908 -0.819083
H  -1.124395 -1.401519 3.24462
H  4.75643 1.76322 1.922476
H  5.383028 0.371404 -2.073357
H  2.165492 2.547445 -0.645953
H  6.186953 1.619302 -0.093831
H  -4.130564 -1.308101 -0.667593
H  -3.28461 -0.242685 3.389831
H  -0.705341 2.513119 -3.736081
H  1.502846 3.573401 -2.907546
totalener: -1413.88502314 hartree
nucrepener: 2130.63929751 hartree
electener: -3544.52432065 hartree
oneelecener: -6139.51172876 hartree
twoeener: 2594.98740811 hartree
kineticenergy: 1409.06404741 hartree
xcener: -115.512322917474 hartree
chargesum: 1.0000000
charge: -0.043240 0.131467 -0.216708 -0.115160 0.052214 0.802826 -0.230924 -0.188467 -0.267189 -0.108204 0.064605 -0.515654 -0.244302 -0.134499 -0.199345 -0.240774 -0.147844 -0.114332 0.139584 -0.101831 -0.102587 -0.095141 0.160356 0.048131 0.103969 0.126899 0.156433 0.162322 0.121909 0.110365 0.126818 0.151929 0.130209 0.121663 0.153845 0.155479 0.216571 0.155891 0.134953 0.136861 0.191816 0.209086
qa: -0.0432 0.1315 -0.2167 -0.1152 0.0522 0.8028 -0.2309 -0.1885 -0.2672 -0.1082 0.0646 -0.5157 -0.2443 -0.1345 -0.1993 -0.2408 -0.1478 -0.1143 0.1396 -0.1018 -0.1026 -0.0951 0.1604 0.0481 0.1040 0.1269 0.1564 0.1623 0.1219 0.1104 0.1268 0.1519 0.1302 0.1217 0.1538 0.1555 0.2166 0.1559 0.1350 0.1369 0.1918 0.2091
va: 1.2633 3.4541 2.9012 3.5522 3.0686 3.2629 3.9148 3.8366 3.5553 3.8198 3.5248 4.0357 4.0185 3.8772 3.9485 4.0064 4.0085 3.9588 3.9313 3.9325 3.9782 3.9603 3.9082 3.9979 1.0019 1.0084 1.0430 0.9944 1.0035 1.0104 1.0218 1.0197 1.0152 1.0133 0.9990 0.9970 0.9795 0.9951 1.0096 1.0084 0.9795 0.9916
dispersion: -0.025077380 hartree
energy: -1413.910100524428 hartree
dipole: 23.56623 -20.42674 3.13949 -1.22286 5.02168 3.79882 1.81622 -3.18327 -1.36705
magnitude: 5.11432 au
magnitude: 12.99956 debye
