program: Orca
programVersion: 5.0.2
elementType: Cl N N N N C C C C C C C C C C C C C C C C C C C H H H H H H H H H H H H H H H H H H
charge: 1
multiplicity: 1
keywords: wb97x-d3
keywords: def2-TZVPP
keywords: def2/J RIJCOSX
keywords: DEFGRID2
keywords: scfconv7
keywords: smallprint printgap noloewdin
keywords: NOSOSCF
formula: C19H18ClN4
InChI: InChI=1/C19H18ClN4/c20-18-8-6-16(7-9-18)10-11-19(12-21,13-24-15-22-14-23-24)17-4-2-1-3-5-17/h1-9,14-15,22H,10-11,13H2
42 atoms
Cl -4.12761 -3.527662 -0.8641
N  0.841923 3.137763 -0.152122
N  1.984701 3.182446 -0.85755
N  0.374705 4.181047 -1.925324
N  -1.664567 0.765739 -0.428794
C  0.564931 0.904847 0.926951
C  0.384011 0.305932 2.343624
C  0.768622 2.431439 1.110625
C  1.737898 0.290761 0.174674
C  0.359999 -1.220186 2.416357
C  -0.753703 -1.847645 1.625796
C  -0.681592 0.75943 0.16861
C  1.613168 -0.212869 -1.113902
C  2.986559 0.256943 0.792488
C  -0.4927 -2.575782 0.469616
C  -2.081236 -1.677763 2.01348
C  2.713867 -0.746718 -1.772457
C  4.083651 -0.276384 0.136266
C  -0.140426 3.737986 -0.788835
C  3.951318 -0.782005 -1.150789
C  -1.521811 -3.098461 -0.300707
C  -3.122569 -2.1905 1.258606
C  1.68334 3.82365 -1.938697
C  -2.831464 -2.891788 0.097334
H  -0.531093 0.717359 2.775901
H  1.204499 0.670894 2.965121
H  -0.055945 2.856187 1.681591
H  1.693946 2.619054 1.65108
H  0.261232 -1.486121 3.47159
H  1.319261 -1.623513 2.088213
H  0.658152 -0.199971 -1.624009
H  3.116025 0.648903 1.794176
H  0.531294 -2.735579 0.154619
H  -2.313548 -1.125987 2.917119
H  2.596524 -1.136617 -2.775231
H  5.045048 -0.297001 0.633012
H  -1.157106 3.851663 -0.448181
H  4.808255 -1.200328 -1.66269
H  -1.299337 -3.657362 -1.199939
H  -4.147784 -2.044869 1.572152
H  2.363663 4.052287 -2.741596
H  -0.124954 4.696337 -2.642445
elementType: Cl N C H
totalener: -1413.99257765 hartree
nucrepener: 2144.40210172 hartree
electener: -3558.39467937 hartree
oneelecener: -6168.37728629 hartree
twoeener: 2609.98260692 hartree
cpcmener: -0.11747268 hartree
kineticenergy: 1409.03293021 hartree
xcener: -115.509816846687 hartree
chargesum: 1.0000000
charge: -0.099189 0.129460 -0.292143 -0.093699 -0.062951 0.840575 -0.241291 -0.134536 -0.197207 -0.093278 0.000926 -0.443371 -0.215196 -0.246127 -0.159073 -0.180843 -0.127131 -0.145459 0.182787 -0.145278 -0.161963 -0.162120 0.159191 0.109580 0.127646 0.117620 0.163594 0.153836 0.111231 0.105768 0.135910 0.141755 0.143853 0.137087 0.159086 0.159725 0.229591 0.160743 0.141605 0.142861 0.200422 0.246002
qa: -0.0992 0.1295 -0.2921 -0.0937 -0.0630 0.8406 -0.2413 -0.1345 -0.1972 -0.0933 0.0009 -0.4434 -0.2152 -0.2461 -0.1591 -0.1808 -0.1271 -0.1455 0.1828 -0.1453 -0.1620 -0.1621 0.1592 0.1096 0.1276 0.1176 0.1636 0.1538 0.1112 0.1058 0.1359 0.1418 0.1439 0.1371 0.1591 0.1597 0.2296 0.1607 0.1416 0.1429 0.2004 0.2460
va: 1.2047 3.4436 2.9007 3.5689 3.1037 3.2289 3.8950 3.8362 3.5965 3.8710 3.5712 4.1106 3.8297 3.9591 3.8996 3.9479 3.8928 3.9275 3.9124 3.9098 4.0105 3.9890 3.9331 3.8177 1.0027 1.0059 0.9969 1.0016 1.0040 1.0070 1.0217 1.0105 0.9930 1.0052 0.9911 0.9905 0.9660 0.9884 1.0066 1.0051 0.9773 0.9663
dispersion: -0.025617294 hartree
energy: -1414.018194947356 hartree
dipole: 18.65163 -16.13738 2.51425 10.16680 -2.56594 7.60086 8.82189 -9.34063 -0.51874
magnitude: 8.02270 au
magnitude: 20.39207 debye
