program: Orca
programVersion: 5.0.2
elementType: Cl N N N N C C C C C C C C C C C C C C C C C C C H H H H H H H H H H H H H H H H H H
charge: 1
multiplicity: 1
keywords: wb97x-d3
keywords: def2-TZVPP
keywords: def2/J RIJCOSX
keywords: DEFGRID2
keywords: scfconv7
keywords: smallprint printgap noloewdin
keywords: NOSOSCF
formula: C19H18ClN4
InChI: InChI=1/C19H18ClN4/c20-18-8-6-16(7-9-18)10-11-19(12-21,13-24-15-22-14-23-24)17-4-2-1-3-5-17/h1-9,14-15,22H,10-11,13H2
42 atoms
Cl -2.305375 -4.039005 -2.021178
N  1.750984 2.960855 0.504345
N  1.036308 4.097063 0.575353
N  2.079918 3.956148 -1.326194
N  -1.705262 2.381763 1.556458
C  0.503711 0.993821 1.378998
C  0.526435 0.016954 2.582268
C  1.681198 1.98143 1.571546
C  0.647517 0.309462 0.021871
C  -0.744342 -0.804536 2.807569
C  -1.169544 -1.6461 1.636979
C  -0.739574 1.766376 1.455951
C  1.745127 -0.522133 -0.197247
C  -0.234576 0.538319 -1.027243
C  -0.370768 -2.696554 1.192022
C  -2.349251 -1.380684 0.951137
C  1.941811 -1.125347 -1.428558
C  -0.039824 -0.070341 -2.26132
C  2.381962 2.860535 -0.645047
C  1.046524 -0.904754 -2.466977
C  -0.713768 -3.43961 0.07553
C  -2.71476 -2.116948 -0.167884
C  1.250982 4.69643 -0.549755
C  -1.883671 -3.133664 -0.604238
H  0.708558 0.601499 3.487177
H  1.387743 -0.641638 2.465778
H  1.585771 2.529004 2.507078
H  2.618756 1.429374 1.591087
H  -1.563209 -0.145294 3.102317
H  -0.550845 -1.444843 3.671918
H  2.459229 -0.715677 0.59415
H  -1.095264 1.182253 -0.897533
H  0.548732 -2.934985 1.713842
H  -2.993923 -0.574233 1.279947
H  2.795186 -1.775034 -1.57399
H  -0.746363 0.112365 -3.060558
H  3.025233 2.0562 -0.963981
H  1.195649 -1.380873 -3.427357
H  -0.073206 -4.243529 -0.261913
H  -3.632016 -1.888334 -0.693991
H  0.842032 5.648946 -0.842217
H  2.416379 4.192084 -2.253781
elementType: Cl N C H
totalener: -1413.99085114 hartree
nucrepener: 2193.30364244 hartree
electener: -3607.29449359 hartree
oneelecener: -6265.29970686 hartree
twoeener: 2658.00521327 hartree
cpcmener: -0.11912895 hartree
kineticenergy: 1409.03830461 hartree
xcener: -115.512338650480 hartree
chargesum: 1.0000000
charge: -0.101618 0.134745 -0.287146 -0.086994 -0.045909 0.860489 -0.222735 -0.145883 -0.255046 -0.112820 0.104858 -0.450900 -0.252054 -0.143306 -0.224500 -0.211710 -0.163069 -0.152482 0.174415 -0.121355 -0.162991 -0.137957 0.161070 0.096934 0.116523 0.121985 0.156417 0.166287 0.103735 0.109780 0.137059 0.135971 0.138221 0.134090 0.157795 0.158216 0.219409 0.161135 0.141751 0.140935 0.200873 0.245781
qa: -0.1016 0.1347 -0.2871 -0.0870 -0.0459 0.8605 -0.2227 -0.1459 -0.2550 -0.1128 0.1049 -0.4509 -0.2521 -0.1433 -0.2245 -0.2117 -0.1631 -0.1525 0.1744 -0.1214 -0.1630 -0.1380 0.1611 0.0969 0.1165 0.1220 0.1564 0.1663 0.1037 0.1098 0.1371 0.1360 0.1382 0.1341 0.1578 0.1582 0.2194 0.1611 0.1418 0.1409 0.2009 0.2458
va: 1.2003 3.4548 2.9005 3.5632 3.1007 3.2274 3.8883 3.8267 3.6289 3.8294 3.4966 4.1520 3.9411 3.7798 3.9528 3.9247 3.8884 3.8913 3.9244 3.8594 3.9294 3.9636 3.9310 3.7871 1.0127 0.9977 1.0125 0.9856 1.0093 1.0046 1.0172 1.0192 1.0039 1.0112 0.9920 0.9927 0.9697 0.9879 1.0067 1.0060 0.9766 0.9664
dispersion: -0.027993631 hartree
energy: -1414.018844775451 hartree
dipole: 12.37529 -6.15446 6.22083 7.82583 -2.60600 5.21983 8.52334 -9.50542 -0.98208
magnitude: 8.17985 au
magnitude: 20.79152 debye
