program: Orca
programVersion: 5.0.2
elementType: Cl N N N N C C C C C C C C C C C C C C C C C C C H H H H H H H H H H H H H H H H H H
charge: 1
multiplicity: 1
keywords: wb97x-d3
keywords: def2-TZVPP
keywords: def2/J RIJCOSX
keywords: DEFGRID2
keywords: scfconv7
keywords: smallprint printgap noloewdin
keywords: NOSOSCF
formula: C19H18ClN4
InChI: InChI=1/C19H18ClN4/c20-18-8-6-16(7-9-18)10-11-19(12-21,13-24-15-22-14-23-24)17-4-2-1-3-5-17/h1-9,14-15,22H,10-11,13H2
42 atoms
Cl -0.400257 -4.985942 -0.297072
N  0.802544 3.346318 -0.59989
N  2.079459 3.014691 -0.852789
N  1.179851 3.997656 -2.570246
N  -2.491328 1.819431 -1.026564
C  -0.483627 1.596883 0.631011
C  -1.057028 1.331096 2.046633
C  0.176556 2.998725 0.661233
C  0.524737 0.540206 0.187839
C  -2.12424 0.23906 2.143108
C  -1.731516 -1.095318 1.570988
C  -1.604352 1.685638 -0.306898
C  0.361914 -0.204611 -0.972493
C  1.659254 0.327194 0.968374
C  -2.413069 -1.634627 0.486227
C  -0.656618 -1.809842 2.095995
C  1.299372 -1.164121 -1.333256
C  2.597738 -0.623912 0.605881
C  0.246902 3.942524 -1.63228
C  2.418296 -1.380093 -0.545355
C  -2.023479 -2.838104 -0.086405
C  -0.246279 -3.006731 1.534731
C  2.295951 3.419557 -2.060643
C  -0.931361 -3.507097 0.436392
H  -1.498725 2.258001 2.419659
H  -0.216124 1.105445 2.703573
H  -0.561694 3.764022 0.893485
H  0.948342 3.028782 1.427488
H  -3.042166 0.582662 1.662112
H  -2.365231 0.131061 3.203707
H  -0.504691 -0.063304 -1.605669
H  1.820713 0.898117 1.87479
H  -3.25778 -1.103545 0.063793
H  -0.114211 -1.421647 2.949971
H  1.144728 -1.747024 -2.23208
H  3.468253 -0.779608 1.230045
H  -0.761771 4.318358 -1.697321
H  3.145072 -2.13216 -0.82335
H  -2.561133 -3.236723 -0.936363
H  0.601476 -3.539145 1.945236
H  3.22484 3.324835 -2.597579
H  1.073884 4.409353 -3.490989
elementType: Cl N C H
totalener: -1413.99028366 hartree
nucrepener: 2197.58584933 hartree
electener: -3611.57613300 hartree
oneelecener: -6274.57752215 hartree
twoeener: 2663.00138915 hartree
cpcmener: -0.11622341 hartree
kineticenergy: 1409.04369739 hartree
xcener: -115.513840712168 hartree
chargesum: 1.0000000
charge: -0.102410 0.131895 -0.281477 -0.092772 -0.054425 0.851871 -0.221003 -0.152294 -0.222763 -0.106499 0.079357 -0.451989 -0.150054 -0.233434 -0.207825 -0.197840 -0.168017 -0.153652 0.185776 -0.132624 -0.128437 -0.179985 0.155289 0.100329 0.112455 0.122510 0.162652 0.159897 0.103126 0.109216 0.135554 0.133148 0.132520 0.136553 0.156210 0.157534 0.226400 0.158275 0.139939 0.141590 0.200138 0.245266
qa: -0.1024 0.1319 -0.2815 -0.0928 -0.0544 0.8519 -0.2210 -0.1523 -0.2228 -0.1065 0.0794 -0.4520 -0.1501 -0.2334 -0.2078 -0.1978 -0.1680 -0.1537 0.1858 -0.1326 -0.1284 -0.1800 0.1553 0.1003 0.1125 0.1225 0.1627 0.1599 0.1031 0.1092 0.1356 0.1331 0.1325 0.1366 0.1562 0.1575 0.2264 0.1583 0.1399 0.1416 0.2001 0.2453
va: 1.2008 3.4532 2.9009 3.5699 3.0960 3.2306 3.8894 3.8312 3.6400 3.8193 3.5246 4.1311 3.7884 3.9211 3.9356 3.9481 3.8842 3.9058 3.9101 3.8664 3.9731 3.9267 3.9377 3.7783 1.0139 0.9972 1.0007 0.9954 1.0076 1.0039 1.0172 1.0148 1.0112 1.0042 0.9948 0.9909 0.9679 0.9895 1.0068 1.0082 0.9776 0.9667
dispersion: -0.028107826 hartree
energy: -1414.018391489213 hartree
dipole: 1.60680 0.61007 2.21687 16.43612 -8.46602 7.97009 6.78964 -8.59245 -1.80281
magnitude: 8.46682 au
magnitude: 21.52095 debye
