program: Orca
programVersion: 5.0.2
elementType: Cl N N N N C C C C C C C C C C C C C C C C C C C H H H H H H H H H H H H H H H H H H
charge: 1
multiplicity: 1
keywords: wb97x-d3
keywords: def2-TZVPP
keywords: def2/J RIJCOSX
keywords: DEFGRID2
keywords: scfconv7
keywords: smallprint printgap noloewdin
keywords: NOSOSCF
formula: C19H18ClN4
InChI: InChI=1/C19H18ClN4/c20-18-8-6-16(7-9-18)10-11-19(12-21,13-24-15-22-14-23-24)17-4-2-1-3-5-17/h1-9,14-15,22H,10-11,13H2
42 atoms
Cl -0.497627 -5.043872 -0.281397
N  1.04368 3.318709 -0.350561
N  2.258928 2.854791 -0.685975
N  1.473261 4.161534 -2.235936
N  -2.371207 2.237937 -0.962531
C  -0.438197 1.595904 0.675148
C  -1.061349 1.25199 2.051075
C  0.388549 2.89291 0.870441
C  0.452029 0.500315 0.093189
C  -2.204122 0.235193 2.043646
C  -1.838804 -1.113778 1.4920
C  -1.5261 1.929797 -0.246155
C  1.497438 0.00191 0.866831
C  0.303217 0.034691 -1.207386
C  -2.327538 -1.54411 0.263998
C  -0.965207 -1.948475 2.184383
C  2.364091 -0.949639 0.355636
C  1.172837 -0.918948 -1.721315
C  0.556882 4.110344 -1.281797
C  2.204828 -1.416219 -0.942718
C  -1.931394 -2.755363 -0.285163
C  -0.555189 -3.159779 1.653475
C  2.508487 3.37958 -1.840434
C  -1.035503 -3.54795 0.411327
H  -1.441745 2.177545 2.489535
H  -0.25814 0.911162 2.705694
H  -0.25104 3.706905 1.20787
H  1.160563 2.730629 1.619536
H  -3.057577 0.640372 1.495875
H  -2.533879 0.132903 3.080386
H  1.649546 0.352957 1.880235
H  -0.497125 0.398349 -1.839513
H  -3.015118 -0.916671 -0.290884
H  -0.579213 -1.644337 3.150531
H  3.16601 -1.328978 0.975662
H  1.034558 -1.273562 -2.734542
H  -0.391593 4.623084 -1.264677
H  2.880368 -2.161381 -1.342242
H  -2.310584 -3.065881 -1.249563
H  0.134535 -3.789448 2.19974
H  3.405181 3.229704 -2.417783
H  1.407714 4.694794 -3.096481
elementType: Cl N C H
totalener: -1413.99033181 hartree
nucrepener: 2190.91602177 hartree
electener: -3604.90635358 hartree
oneelecener: -6261.25625957 hartree
twoeener: 2656.34990599 hartree
cpcmener: -0.11711315 hartree
kineticenergy: 1409.04618388 hartree
xcener: -115.512803885734 hartree
chargesum: 1.0000000
charge: -0.101543 0.128106 -0.281931 -0.091171 -0.056197 0.836336 -0.217853 -0.145207 -0.214486 -0.104110 0.115938 -0.443046 -0.241687 -0.161804 -0.213667 -0.244220 -0.171106 -0.159886 0.184523 -0.120791 -0.146112 -0.149831 0.154303 0.099185 0.114958 0.121951 0.163125 0.158541 0.102507 0.109477 0.138589 0.136030 0.135721 0.138108 0.156393 0.157192 0.227672 0.159357 0.139590 0.141288 0.200101 0.245658
qa: -0.1015 0.1281 -0.2819 -0.0912 -0.0562 0.8363 -0.2179 -0.1452 -0.2145 -0.1041 0.1159 -0.4430 -0.2417 -0.1618 -0.2137 -0.2442 -0.1711 -0.1599 0.1845 -0.1208 -0.1461 -0.1498 0.1543 0.0992 0.1150 0.1220 0.1631 0.1585 0.1025 0.1095 0.1386 0.1360 0.1357 0.1381 0.1564 0.1572 0.2277 0.1594 0.1396 0.1413 0.2001 0.2457
va: 1.2007 3.4551 2.9010 3.5698 3.0888 3.2547 3.8886 3.8353 3.6272 3.8279 3.4806 4.1270 3.9110 3.7815 3.9119 3.9738 3.9027 3.9030 3.9120 3.8526 3.9481 3.9289 3.9372 3.7735 1.0129 0.9990 1.0006 0.9960 1.0103 1.0048 1.0132 1.0188 1.0090 1.0051 0.9925 0.9927 0.9672 0.9881 1.0068 1.0062 0.9779 0.9664
dispersion: -0.027759114 hartree
energy: -1414.018090919292 hartree
dipole: 1.73781 0.98692 2.72473 16.14931 -8.15554 7.99377 6.39689 -7.63976 -1.24287
magnitude: 8.53635 au
magnitude: 21.69768 debye
