program: Orca
programVersion: 5.0.2
elementType: Cl N N N N C C C C C C C C C C C C C C C C C C C H H H H H H H H H H H H H H H H H H
charge: 1
multiplicity: 1
keywords: wb97x-d3
keywords: def2-TZVPP
keywords: def2/J RIJCOSX
keywords: DEFGRID2
keywords: scfconv7
keywords: smallprint printgap noloewdin
keywords: NOSOSCF
formula: C19H18ClN4
InChI: InChI=1/C19H18ClN4/c20-18-8-6-16(7-9-18)10-11-19(12-21,13-24-15-22-14-23-24)17-4-2-1-3-5-17/h1-9,14-15,22H,10-11,13H2
42 atoms
Cl -5.37794 -3.440187 2.904756
N  1.45521 3.071644 -1.608263
N  2.632378 3.375684 -1.035088
N  2.633604 3.914355 -3.143031
N  0.440737 0.093378 -3.320633
C  0.589114 0.872322 -0.829392
C  -0.62245 0.266402 -0.081887
C  0.405468 2.406804 -0.860315
C  1.914159 0.48736 -0.182902
C  -0.577528 -1.257146 0.001208
C  -1.775113 -1.80311 0.725605
C  0.528239 0.412713 -2.219576
C  2.93366 -0.140299 -0.886821
C  2.111608 0.787601 1.164078
C  -2.934663 -2.142309 0.034212
C  -1.759828 -1.96507 2.108141
C  4.129546 -0.464829 -0.257138
C  3.303431 0.464577 1.790616
C  1.44446 3.391703 -2.884389
C  4.319056 -0.164525 1.081553
C  -4.047691 -2.640332 0.694712
C  -2.862271 -2.461849 2.787289
C  3.341306 3.89041 -1.986242
C  -3.999431 -2.79904 2.07039
H  -1.537746 0.587655 -0.58545
H  -0.649462 0.69696 0.921371
H  -0.547224 2.666066 -1.320583
H  0.415383 2.806444 0.151434
H  0.334121 -1.572875 0.512212
H  -0.538562 -1.682597 -1.004851
H  2.81516 -0.389448 -1.933932
H  1.336295 1.280257 1.738459
H  -2.972455 -2.02845 -1.042764
H  -0.868678 -1.710592 2.669976
H  4.911357 -0.956121 -0.821621
H  3.438909 0.705207 2.837064
H  0.627889 3.261501 -3.576286
H  5.249788 -0.418564 1.571917
H  -4.936221 -2.907443 0.138258
H  -2.827813 -2.590066 3.860917
H  4.349791 4.256335 -1.890393
H  2.944932 4.267194 -4.042382
elementType: Cl N C H
totalener: -1413.99495538 hartree
nucrepener: 2031.24156542 hartree
electener: -3445.23652079 hartree
oneelecener: -5941.64666560 hartree
twoeener: 2496.41014481 hartree
cpcmener: -0.11776093 hartree
kineticenergy: 1409.02238057 hartree
xcener: -115.502650370293 hartree
chargesum: 1.0000000
charge: -0.099573 0.131761 -0.288093 -0.094380 -0.056881 0.787431 -0.250565 -0.150752 -0.325281 -0.029313 0.017442 -0.391836 -0.107621 -0.196323 -0.209311 -0.208425 -0.158914 -0.162239 0.184331 -0.127926 -0.148009 -0.153332 0.158733 0.090319 0.129049 0.122145 0.165243 0.157302 0.104392 0.106385 0.135727 0.140456 0.141403 0.141671 0.159028 0.159727 0.230620 0.162097 0.142734 0.143542 0.200578 0.246656
qa: -0.0996 0.1318 -0.2881 -0.0944 -0.0569 0.7874 -0.2506 -0.1508 -0.3253 -0.0293 0.0174 -0.3918 -0.1076 -0.1963 -0.2093 -0.2084 -0.1589 -0.1622 0.1843 -0.1279 -0.1480 -0.1533 0.1587 0.0903 0.1290 0.1221 0.1652 0.1573 0.1044 0.1064 0.1357 0.1405 0.1414 0.1417 0.1590 0.1597 0.2306 0.1621 0.1427 0.1435 0.2006 0.2467
va: 1.2049 3.4422 2.9008 3.5692 3.1036 3.3763 3.8801 3.8484 3.6727 3.7001 3.5800 4.1278 3.8109 3.9338 3.9899 3.9837 3.9381 3.9426 3.9107 3.8833 3.9813 3.9858 3.9340 3.8328 1.0123 1.0053 0.9980 0.9987 1.0122 1.0141 1.0175 1.0133 1.0046 1.0044 0.9928 0.9914 0.9649 0.9882 1.0055 1.0054 0.9773 0.9659
dispersion: -0.022392245 hartree
energy: -1414.017347621827 hartree
dipole: 18.15143 -13.76046 4.39097 10.72160 -3.33834 7.38326 -5.69216 1.61754 -4.07462
magnitude: 9.50767 au
magnitude: 24.16657 debye
