program: Orca
programVersion: 5.0.2
elementType: Cl N N N N C C C C C C C C C C C C C C C C C C C H H H H H H H H H H H H H H H H H H
charge: 1
multiplicity: 1
keywords: wb97x-d3
keywords: def2-TZVPP
keywords: def2/J RIJCOSX
keywords: DEFGRID2
keywords: scfconv7
keywords: smallprint printgap noloewdin
keywords: NOSOSCF
formula: C19H18ClN4
InChI: InChI=1/C19H18ClN4/c20-18-8-6-16(7-9-18)10-11-19(12-21,13-24-15-22-14-23-24)17-4-2-1-3-5-17/h1-9,14-15,22H,10-11,13H2
42 atoms
Cl -5.310176 -3.597221 2.820737
N  1.459001 3.205875 -1.327176
N  2.684901 3.409597 -0.80869
N  2.571866 4.149022 -2.854201
N  0.211885 0.462825 -3.305027
C  0.562043 0.953709 -0.760234
C  -0.618806 0.297231 -0.006732
C  0.435906 2.4850 -0.594888
C  1.908868 0.454824 -0.253319
C  -0.605359 -1.227039 -0.088239
C  -1.77814 -1.822499 0.635909
C  0.389948 0.658723 -2.184821
C  2.194056 0.576921 1.105882
C  2.86281 -0.10501 -1.092976
C  -2.981333 -2.055266 -0.02382
C  -1.694945 -2.136356 1.989534
C  3.409859 0.147512 1.611053
C  4.083982 -0.533627 -0.585626
C  1.381714 3.645952 -2.564284
C  4.362069 -0.408885 0.765548
C  -4.07281 -2.596422 0.638967
C  -2.774623 -2.678556 2.670749
C  3.349291 3.988927 -1.75488
C  -3.956802 -2.905628 1.984628
H  -1.552525 0.687199 -0.418422
H  -0.575523 0.61806 1.035947
H  -0.532479 2.828051 -0.954681
H  0.523735 2.753728 0.455058
H  0.321355 -1.611766 0.341051
H  -0.626947 -1.543296 -1.134052
H  1.469429 1.013871 1.782133
H  2.673334 -0.214756 -2.153158
H  -3.070636 -1.820908 -1.077751
H  -0.768028 -1.965984 2.52409
H  3.614426 0.250046 2.668576
H  4.816042 -0.965301 -1.255224
H  0.518223 3.619919 -3.209301
H  5.31257 -0.742598 1.160255
H  -4.997352 -2.77817 0.107783
H  -2.688672 -2.924679 3.720512
H  4.375239 4.31003 -1.694116
H  2.839094 4.575623 -3.734971
elementType: Cl N C H
totalener: -1413.98980548 hartree
nucrepener: 2032.63472889 hartree
electener: -3446.62453438 hartree
oneelecener: -5944.30442822 hartree
twoeener: 2497.67989385 hartree
cpcmener: -0.13286800 hartree
kineticenergy: 1409.02213487 hartree
xcener: -115.503216852853 hartree
chargesum: 1.0000000
charge: -0.105305 0.127174 -0.295345 -0.090473 -0.072640 0.814771 -0.261557 -0.142231 -0.330488 -0.018502 0.011801 -0.382539 -0.199653 -0.110107 -0.210229 -0.208802 -0.163806 -0.161607 0.185591 -0.134441 -0.152856 -0.157492 0.158028 0.093216 0.130691 0.123756 0.165096 0.157161 0.101843 0.105514 0.143973 0.134532 0.143679 0.144031 0.161497 0.160925 0.232027 0.162984 0.144041 0.144746 0.201018 0.249981
qa: -0.1053 0.1272 -0.2953 -0.0905 -0.0726 0.8148 -0.2616 -0.1422 -0.3305 -0.0185 0.0118 -0.3825 -0.1997 -0.1101 -0.2102 -0.2088 -0.1638 -0.1616 0.1856 -0.1344 -0.1529 -0.1575 0.1580 0.0932 0.1307 0.1238 0.1651 0.1572 0.1018 0.1055 0.1440 0.1345 0.1437 0.1440 0.1615 0.1609 0.2320 0.1630 0.1440 0.1447 0.2010 0.2500
va: 1.1992 3.4508 2.9022 3.5695 3.1063 3.3427 3.8867 3.8474 3.6768 3.6903 3.5849 4.1398 3.9262 3.8077 3.9860 3.9802 3.9299 3.9278 3.9097 3.8767 3.9775 3.9833 3.9378 3.8128 1.0115 1.0045 0.9981 0.9982 1.0125 1.0145 1.0125 1.0183 1.0042 1.0038 0.9906 0.9919 0.9641 0.9878 1.0050 1.0050 0.9774 0.9636
dispersion: -0.022450374 hartree
energy: -1414.012255857850 hartree
dipole: 18.18483 -13.76728 4.41755 10.75450 -2.93733 7.81717 -5.54933 1.97959 -3.56974
magnitude: 9.66260 au
magnitude: 24.56039 debye
