program: Orca
programVersion: 5.0.2
elementType: Cl N N N N C C C C C C C C C C C C C C C C C C C H H H H H H H H H H H H H H H H H H
charge: 1
multiplicity: 1
keywords: wb97x-d3
keywords: def2-TZVPP
keywords: def2/J RIJCOSX
keywords: DEFGRID2
keywords: scfconv7
keywords: smallprint printgap noloewdin
keywords: NOSOSCF
formula: C19H18ClN4
InChI: InChI=1/C19H18ClN4/c20-18-8-6-16(7-9-18)10-11-19(12-21,13-24-15-22-14-23-24)17-4-2-1-3-5-17/h1-9,14-15,22H,10-11,13H2
42 atoms
Cl 0.021716 -5.128089 0.793375
N  1.015464 3.356067 -0.490427
N  2.290015 2.931101 -0.579851
N  1.704239 4.015201 -2.375279
N  -2.373824 2.270881 -1.515486
C  -0.635993 1.69405 0.353719
C  -1.452484 1.395284 1.634793
C  0.174374 2.983423 0.631333
C  0.306351 0.578711 -0.085344
C  -2.500252 0.284284 1.533562
C  -1.934618 -1.096129 1.355113
C  -1.600017 1.997814 -0.70773
C  1.080479 -0.076909 0.868199
C  0.461738 0.23911 -1.424443
C  -1.895736 -1.701204 0.103862
C  -1.38926 -1.781286 2.436949
C  1.956654 -1.082659 0.493778
C  1.346381 -0.763432 -1.801322
C  0.650697 4.009552 -1.573085
C  2.087619 -1.436562 -0.843179
C  -1.298267 -2.939275 -0.079582
C  -0.793139 -3.022878 2.277669
C  2.695128 3.345554 -1.736364
C  -0.744494 -3.586965 1.012853
H  -1.966061 2.318464 1.912719
H  -0.753408 1.181621 2.444276
H  -0.489555 3.818044 0.849767
H  0.824164 2.825453 1.488868
H  -3.203745 0.507471 0.728415
H  -3.078754 0.321285 2.458933
H  1.001283 0.182365 1.915694
H  -0.110008 0.741838 -2.19506
H  -2.318946 -1.190491 -0.75259
H  -1.415257 -1.334967 3.424004
H  2.535663 -1.593926 1.25174
H  1.446839 -1.020127 -2.847635
H  -0.30417 4.473119 -1.76492
H  2.766606 -2.227711 -1.132824
H  -1.263262 -3.3868 -1.063454
H  -0.368759 -3.537546 3.129093
H  3.679749 3.195629 -2.145938
H  1.750419 4.457156 -3.287328
elementType: Cl N C H
totalener: -1413.98632228 hartree
nucrepener: 2189.29086308 hartree
electener: -3603.27718536 hartree
oneelecener: -6257.62096126 hartree
twoeener: 2654.34377590 hartree
cpcmener: -0.13234325 hartree
kineticenergy: 1409.02600609 hartree
xcener: -115.510513556587 hartree
chargesum: 1.0000000
charge: -0.106373 0.114063 -0.288635 -0.082220 -0.073954 0.773596 -0.222708 -0.103475 -0.246042 -0.097899 0.087202 -0.411836 -0.194151 -0.126859 -0.179209 -0.232306 -0.185370 -0.167074 0.188090 -0.133638 -0.183555 -0.138983 0.150919 0.098121 0.120132 0.120576 0.165570 0.154521 0.100986 0.108312 0.144712 0.132458 0.141218 0.139846 0.158790 0.158258 0.222922 0.159539 0.142735 0.141483 0.200359 0.249879
qa: -0.1064 0.1141 -0.2886 -0.0822 -0.0740 0.7736 -0.2227 -0.1035 -0.2460 -0.0979 0.0872 -0.4118 -0.1942 -0.1269 -0.1792 -0.2323 -0.1854 -0.1671 0.1881 -0.1336 -0.1836 -0.1390 0.1509 0.0981 0.1201 0.1206 0.1656 0.1545 0.1010 0.1083 0.1447 0.1325 0.1412 0.1398 0.1588 0.1583 0.2229 0.1595 0.1427 0.1415 0.2004 0.2499
va: 1.1971 3.4764 2.8959 3.5701 3.0955 3.3789 3.9025 3.8035 3.5798 3.8460 3.4934 4.1428 3.9207 3.7700 3.9184 3.9673 3.8833 3.9097 3.9129 3.8446 3.9328 3.9494 3.9410 3.7601 1.0108 1.0009 0.9992 0.9990 1.0137 1.0032 1.0078 1.0176 1.0028 1.0042 0.9936 0.9920 0.9705 0.9892 1.0075 1.0054 0.9782 0.9634
dispersion: -0.028124298 hartree
energy: -1414.014446574696 hartree
dipole: -0.95269 3.56554 2.61285 16.42286 -8.37657 8.04628 2.28629 -4.18015 -1.89386
magnitude: 8.66928 au
magnitude: 22.03555 debye
