program: Orca
programVersion: 5.0.2
elementType: Cl N N N N C C C C C C C C C C C C C C C C C C C H H H H H H H H H H H H H H H H H H
charge: 1
multiplicity: 1
keywords: wb97x-d3
keywords: def2-TZVPP
keywords: def2/J RIJCOSX
keywords: DEFGRID2
keywords: scfconv7
keywords: smallprint printgap noloewdin
keywords: NOSOSCF
formula: C19H18ClN4
InChI: InChI=1/C19H18ClN4/c20-18-8-6-16(7-9-18)10-11-19(12-21,13-24-15-22-14-23-24)17-4-2-1-3-5-17/h1-9,14-15,22H,10-11,13H2
42 atoms
Cl -4.833831 -4.317578 2.710904
N  1.323681 3.05423 -0.823635
N  1.093688 3.584756 -2.039597
N  3.020598 4.232023 -1.260622
N  0.386049 0.405836 -3.269539
C  0.779386 0.635847 -0.694035
C  -0.172537 -0.36999 -0.000468
C  0.418869 2.075556 -0.254674
C  2.238308 0.364492 -0.338909
C  -1.638499 -0.296967 -0.431007
C  -2.457548 -1.293917 0.339883
C  0.575904 0.51655 -2.139644
C  3.244337 0.368626 -1.299679
C  2.590357 0.211608 1.001774
C  -2.408201 -2.649567 0.022841
C  -3.256396 -0.894633 1.406238
C  4.574772 0.217406 -0.929743
C  3.918147 0.061248 1.368907
C  2.492332 3.428669 -0.350322
C  4.916603 0.06428 0.404036
C  -3.132573 -3.584227 0.745709
C  -3.991858 -1.814265 2.140823
C  2.138654 4.305274 -2.287203
C  -3.92103 -3.155454 1.802506
H  -0.107904 -0.201892 1.075291
H  0.213616 -1.372691 -0.191839
H  -0.58808 2.354547 -0.553849
H  0.486781 2.141752 0.829518
H  -1.726658 -0.504652 -1.499695
H  -2.040461 0.703847 -0.265158
H  3.009515 0.495148 -2.348946
H  1.834038 0.226192 1.775978
H  -1.797187 -2.986904 -0.806008
H  -3.312934 0.154281 1.670763
H  5.342373 0.224298 -1.692228
H  4.171582 -0.052926 2.414391
H  2.925656 3.159548 0.599447
H  5.953156 -0.048449 0.692231
H  -3.084266 -4.632444 0.483489
H  -4.610577 -1.483131 2.963981
H  2.2989 4.89224 -3.175037
H  3.917025 4.701223 -1.191899
elementType: Cl N C H
totalener: -1413.98836568 hartree
nucrepener: 2029.12815903 hartree
electener: -3443.11652470 hartree
oneelecener: -5936.32010123 hartree
twoeener: 2493.20357652 hartree
cpcmener: -0.13770528 hartree
kineticenergy: 1409.02056968 hartree
xcener: -115.503960594550 hartree
chargesum: 1.0000000
charge: -0.105079 0.130356 -0.296022 -0.079476 -0.075109 0.791588 -0.271363 -0.123606 -0.250021 -0.004025 -0.012065 -0.390148 -0.147002 -0.208308 -0.223915 -0.197552 -0.144380 -0.167554 0.164419 -0.138481 -0.146681 -0.150607 0.161138 0.089173 0.119788 0.129034 0.156939 0.164074 0.102315 0.096128 0.138457 0.147668 0.147403 0.142802 0.161790 0.161888 0.222484 0.163530 0.144757 0.144500 0.201423 0.249740
qa: -0.1051 0.1304 -0.2960 -0.0795 -0.0751 0.7916 -0.2714 -0.1236 -0.2500 -0.0040 -0.0121 -0.3901 -0.1470 -0.2083 -0.2239 -0.1976 -0.1444 -0.1676 0.1644 -0.1385 -0.1467 -0.1506 0.1611 0.0892 0.1198 0.1290 0.1569 0.1641 0.1023 0.0961 0.1385 0.1477 0.1474 0.1428 0.1618 0.1619 0.2225 0.1635 0.1448 0.1445 0.2014 0.2497
va: 1.1996 3.4677 2.9038 3.5615 3.1159 3.4191 3.9027 3.8306 3.6407 3.7013 3.6175 4.1316 3.8344 3.9756 3.9858 3.9766 3.9212 3.9242 3.9380 3.8908 3.9723 3.9767 3.9347 3.8195 1.0051 1.0052 1.0114 0.9893 1.0188 1.0201 1.0185 1.0103 1.0016 1.0040 0.9909 0.9915 0.9669 0.9878 1.0051 1.0051 0.9770 0.9637
dispersion: -0.022581459 hartree
energy: -1414.010947136942 hartree
dipole: 18.32354 -12.22463 6.09891 13.56232 -5.87862 7.68370 -2.92073 3.33381 0.41308
magnitude: 9.81868 au
magnitude: 24.95711 debye
