program: Orca
programVersion: 5.0.2
elementType: N C C C C C C C C C C C C C C C C C C C H H H H H H H H H H H H H H H H H H H H H H H H H H H H H H H H
charge: 1
multiplicity: 1
keywords: wb97x-d3
keywords: def2-TZVPP
keywords: def2/J RIJCOSX
keywords: DEFGRID2
keywords: scfconv7
keywords: smallprint printgap noloewdin
keywords: NOSOSCF
formula: C19H32N
InChI: InChI=1/C19H32N/c1-16(15-20-12-6-5-7-13-20)14-17-8-10-18(11-9-17)19(2,3)4/h8-11,16,20H,5-7,12-15H2,1-4H3
52 atoms
N  -1.346624 2.759037 -0.270342
C  -1.469001 1.288078 -0.535052
C  -2.424212 0.556932 0.399473
C  -0.739175 3.060692 1.067115
C  -0.592062 3.445703 -1.37044
C  -0.672778 4.555966 1.315531
C  -0.527936 4.943952 -1.145934
C  0.08298 5.276771 0.208253
C  -2.461479 -0.924257 -0.016775
C  -3.822927 1.164478 0.38748
C  -1.104943 -1.572643 -0.005448
C  2.879624 -3.336061 0.008328
C  1.489591 -2.71145 0.031673
C  -0.437357 -1.878368 -1.187443
C  -0.458179 -1.849051 1.192028
C  0.830413 -2.434182 -1.166552
C  0.81218 -2.40777 1.20952
C  3.840291 -2.403287 -0.741209
C  2.811084 -4.689997 -0.710685
C  3.435465 -3.567442 1.413334
H  -0.462392 0.87207 -0.479962
H  -1.814053 1.190562 -1.567192
H  -2.02741 0.587621 1.419101
H  0.253267 2.605889 1.061414
H  -1.335925 2.556834 1.82451
H  -1.088661 3.196265 -2.307771
H  0.403746 2.999111 -1.387112
H  -1.685593 4.960488 1.411584
H  -0.19406 4.710269 2.283221
H  0.054846 5.378717 -1.958853
H  -1.53081 5.375295 -1.228377
H  0.062001 6.353033 0.376679
H  1.135677 4.980336 0.2232
H  -2.913968 -1.010398 -1.009627
H  -3.135482 -1.444348 0.668208
H  -3.865446 2.172296 0.811579
H  -4.504373 0.564738 0.989343
H  -4.236145 1.202224 -0.62282
H  -0.921213 -1.699146 -2.141481
H  -0.956639 -1.648868 2.134629
H  1.30676 -2.667049 -2.11072
H  1.265654 -2.617603 2.168117
H  4.843484 -2.831555 -0.766833
H  3.533416 -2.237529 -1.774613
H  3.907879 -1.429882 -0.252637
H  2.12932 -5.37257 -0.202183
H  2.473295 -4.594288 -1.743113
H  3.796733 -5.157685 -0.733799
H  4.430845 -4.007384 1.346953
H  3.53291 -2.63877 1.978863
H  2.818824 -4.257264 1.991797
H  -2.292684 3.147848 -0.265821
totalener: -797.92659175 hartree
nucrepener: 1605.37461993 hartree
electener: -2403.30121168 hartree
oneelecener: -4246.11533809 hartree
twoeener: 1842.81412641 hartree
kineticenergy: 793.88426945 hartree
xcener: -82.869171390550 hartree
chargesum: 1.0000000
charge: 0.190598 -0.221159 0.051760 -0.174238 -0.141816 -0.162700 -0.169567 -0.103003 -0.186149 -0.287989 0.038153 0.246838 -0.067890 -0.210674 -0.180439 -0.139096 -0.138908 -0.291260 -0.285157 -0.330860 0.152123 0.139022 0.064315 0.140963 0.146988 0.133121 0.140889 0.096063 0.111637 0.113157 0.096859 0.106637 0.093764 0.107528 0.121120 0.072301 0.112873 0.112354 0.117097 0.120244 0.120714 0.134082 0.101095 0.087956 0.088643 0.105118 0.088936 0.097843 0.101107 0.091756 0.101350 0.145901
qa: 0.1906 -0.2212 0.0518 -0.1742 -0.1418 -0.1627 -0.1696 -0.1030 -0.1861 -0.2880 0.0382 0.2468 -0.0679 -0.2107 -0.1804 -0.1391 -0.1389 -0.2913 -0.2852 -0.3309 0.1521 0.1390 0.0643 0.1410 0.1470 0.1331 0.1409 0.0961 0.1116 0.1132 0.0969 0.1066 0.0938 0.1075 0.1211 0.0723 0.1129 0.1124 0.1171 0.1202 0.1207 0.1341 0.1011 0.0880 0.0886 0.1051 0.0889 0.0978 0.1011 0.0918 0.1014 0.1459
va: 3.5701 3.8335 3.7424 3.8597 3.8387 3.9017 3.9069 3.8198 3.8628 3.9380 3.5543 3.7588 3.7596 4.0259 4.0408 4.0690 3.9800 3.9201 3.9222 3.9313 1.0107 1.0048 1.0211 1.0023 1.0004 1.0070 1.0000 1.0144 1.0180 1.0180 1.0137 1.0170 1.0152 1.0097 1.0104 1.0072 1.0114 0.9981 1.0125 1.0109 1.0101 1.0039 1.0090 1.0070 1.0061 1.0051 1.0072 1.0064 1.0125 1.0014 1.0012 1.0239
dispersion: -0.024680197 hartree
energy: -797.951271944882 hartree
dipole: 2.59274 -4.38345 -1.79071 8.01181 -3.56186 4.44995 0.06150 -0.28393 -0.22243
magnitude: 4.80189 au
magnitude: 12.20544 debye
