program: Orca
programVersion: 5.0.2
elementType: N C C C C C C C C C C C C C C C C C C C H H H H H H H H H H H H H H H H H H H H H H H H H H H H H H H H
charge: 1
multiplicity: 1
keywords: wb97x-d3
keywords: def2-TZVPP
keywords: def2/J RIJCOSX
keywords: DEFGRID2
keywords: scfconv7
keywords: smallprint printgap noloewdin
keywords: NOSOSCF
formula: C19H32N
InChI: InChI=1/C14H21.C5H11N/c1-5-6-7-12-8-10-13(11-9-12)14(2,3)4;1-2-4-6-5-3-1/h5,8-11H,6-7H2,1-4H3;6H,1-5H2
52 atoms
N  3.608536 4.175567 -0.746542
C  -4.732496 -2.937662 -0.198643
C  -5.228384 -1.720916 0.309046
C  3.807759 3.936555 0.678267
C  2.218777 4.514368 -1.029811
C  2.869452 2.891558 1.269656
C  1.209341 3.498425 -0.508523
C  1.414551 3.245956 0.981412
C  -3.839773 -2.025831 -1.217341
C  -4.652308 -0.992072 1.425372
C  -2.414909 -1.898567 -0.79609
C  1.777331 -1.486725 0.287462
C  0.309783 -1.658067 -0.086994
C  -1.85765 -0.653369 -0.518402
C  -1.598031 -3.020068 -0.71004
C  -0.521882 -0.538994 -0.169186
C  -0.259859 -2.899905 -0.3652
C  2.52544 -2.817655 0.329776
C  1.873404 -0.836007 1.673025
C  2.4567 -0.586688 -0.751847
H  -4.073367 -3.509881 0.444632
H  -5.428051 -3.53719 -0.772553
H  -6.091077 -1.282753 -0.18401
H  3.667599 4.886737 1.203724
H  4.847217 3.64688 0.842608
H  2.102417 4.642835 -2.107469
H  2.011104 5.490823 -0.580436
H  3.103317 1.914421 0.833364
H  3.040268 2.80251 2.345799
H  0.193072 3.849929 -0.705476
H  1.328279 2.559027 -1.060072
H  0.748821 2.452623 1.332301
H  1.144769 4.148077 1.54122
H  -4.26598 -1.03571 -1.428992
H  -3.977522 -2.56854 -2.153401
H  -5.399461 -1.123133 2.223557
H  -4.607844 0.080029 1.240833
H  -3.70731 -1.393071 1.779492
H  -2.471992 0.236941 -0.58219
H  -2.005148 -4.002494 -0.919869
H  -0.126016 0.448411 0.038533
H  0.336491 -3.80055 -0.318938
H  2.109519 -3.50155 1.071922
H  2.519779 -3.32399 -0.637064
H  3.568345 -2.642498 0.598635
H  2.919015 -0.694564 1.954153
H  1.390605 0.141877 1.703726
H  1.406301 -1.46239 2.435447
H  2.422477 -1.036749 -1.745841
H  1.986572 0.39549 -0.815358
H  3.506046 -0.431928 -0.492179
H  3.814054 3.306927 -1.230681
elementType: N C H
totalener: -797.91191219 hartree
nucrepener: 1554.54106979 hartree
electener: -2352.45298198 hartree
oneelecener: -4145.91725028 hartree
twoeener: 1793.46426829 hartree
cpcmener: -0.11336269 hartree
kineticenergy: 793.82257487 hartree
xcener: -82.795184065554 hartree
chargesum: 1.0000000
charge: -0.314987 -0.043557 0.168121 -0.079101 -0.068014 -0.127344 -0.143883 -0.152477 -0.017765 -0.193947 -0.051957 0.405980 -0.117180 -0.207618 -0.188221 -0.136475 -0.145954 -0.364558 -0.373989 -0.348062 0.125013 0.123467 0.194019 0.081938 0.087026 0.086837 0.078650 0.050763 0.077849 0.075281 0.069516 0.084729 0.085929 0.145888 0.149441 0.154903 0.130342 0.116831 0.148740 0.150282 0.126059 0.149134 0.102442 0.102256 0.101248 0.101962 0.093273 0.110064 0.110311 0.067533 0.101589 0.117674
qa: -0.3150 -0.0436 0.1681 -0.0791 -0.0680 -0.1273 -0.1439 -0.1525 -0.0178 -0.1939 -0.0520 0.4060 -0.1172 -0.2076 -0.1882 -0.1365 -0.1460 -0.3646 -0.3740 -0.3481 0.1250 0.1235 0.1940 0.0819 0.0870 0.0868 0.0786 0.0508 0.0778 0.0753 0.0695 0.0847 0.0859 0.1459 0.1494 0.1549 0.1303 0.1168 0.1487 0.1503 0.1261 0.1491 0.1024 0.1023 0.1012 0.1020 0.0933 0.1101 0.1103 0.0675 0.1016 0.1177
va: 2.9375 3.9232 3.5866 3.9746 3.9635 3.8071 3.8187 3.8529 3.8621 3.9680 3.6269 3.5183 3.7726 3.9909 3.9939 3.9534 3.8765 3.9321 3.9387 3.9454 1.0131 1.0153 0.9768 1.0026 1.0046 1.0046 1.0023 1.0214 1.0172 1.0185 1.0064 1.0083 1.0117 1.0026 0.9942 0.9954 1.0037 1.0029 0.9982 0.9990 1.0055 0.9966 1.0003 1.0002 1.0057 1.0002 1.0010 1.0086 1.0103 1.0061 1.0006 1.0284
dispersion: -0.024355507 hartree
energy: -797.936267697566 hartree
dipole: 5.56846 -14.52690 -8.95844 6.17274 -10.06132 -3.88858 5.19662 -4.88054 0.31608
magnitude: 9.77111 au
magnitude: 24.83618 debye
