program: Gaussian 09
title: 000070941
version: EM64L-G09RevD.01
frameworkgroup: C1[X(C5H8O2S)]
method: RPBEPBE
basis: SDD
operation: Freq
keyword: #pfreq=noraman
keyword: PBEPBE/SDD
title: #p freq=noraman PBEPBE/SDD
converged: NO NO NO NO
title: Mulliken charges:
elementType: S O O C C C C C H H H H H H H H
charge: 0.953588 -0.559786 -0.559791 -0.691633 -0.602448 0.434279 -0.316273 -0.774083 0.287381 0.287377 0.286484 0.286487 0.258022 0.238241 0.236074 0.236079
chargesum: 0.00000
title: Mulliken charges with hydrogens summed into heavy atoms:
elementType: S O O C C C C C
charge: 0.953588 -0.559786 -0.559791 -0.116874 -0.029476 0.434279 -0.058251 -0.063689
polarizability: 9.57588952e+01 -2.74008844e+00 8.25143255e+01 1.16110883e-03 1.00750865e-03 6.81279998e+01
1716.lowfreq: -32.9025 -16.6640 -10.3514 -0.0035 -0.0031 -0.0029 17.5127 144.5927 185.9519
frequency: -31.8026 144.5881 185.8973 226.8429 231.8476 256.5352 271.2663 351.1976 425.6311 435.7159 505.9012 580.7214 677.3733 757.5901 814.5332 821.9172 861.4532 878.2471 954.8947 966.0157 1026.3488 1057.3176 1092.3922 1118.3922 1138.2465 1200.9933 1219.2901 1327.3382 1398.6260 1412.5929 1419.9487 1457.4395 1468.1951 1672.8106 2975.9951 3033.4302 3034.1650 3053.1968 3093.1089 3117.3784 3118.5103 3133.9816
redmass: 3.4802 1.2815 2.7538 3.7785 4.8686 2.0328 8.9806 3.4524 2.0081 10.8171 7.1143 5.2829 4.9984 1.1907 17.9832 1.7783 4.0342 1.4659 3.9543 1.5252 1.3144 1.5346 1.2102 1.3312 1.5871 1.5903 1.7191 2.1610 1.2182 1.1140 1.1048 1.0451 1.0654 6.7890 1.0369 1.0552 1.0555 1.0973 1.0992 1.1096 1.1093 1.0928
irintensity: 3.5921 1.5161 0.2351 4.8468 6.7867 1.1132 11.7661 16.6050 8.6410 12.4949 25.4498 3.6776 11.7384 23.0261 91.2442 15.7535 0.4841 0.3817 54.2826 0.0042 30.4095 14.5079 9.3560 2.1414 0.2210 4.5313 3.2487 6.0296 14.3031 11.3067 9.6512 18.0045 18.4717 4.5877 24.9400 6.4824 2.8632 16.2933 18.7271 0.2934 0.1672 6.3988
temp: 298.150 k
press: 1.00000 atm
elementType: 16 8 8 6 6 6 6 6 1 1 1 1 1 1 1 1
symmnumber: 1
zpe: 316519.1 jmol-1
zpe.correction: 0.120556 hartree
zpe.thermalcorrener: 0.128681 hartree
zpe.thermalcorrenthalpy: 0.129625 hartree
zpe.thermalcorrgfe: 0.088093 hartree
zpe.sumelectzpe: -743.033449 hartree
zpe.sumelectthermal: -743.025324 hartree
zpe.sumelectthermalent: -743.024379 hartree
zpe.sumelectthermalfe: -743.065911 hartree
dipole: 6.5137 1.4076 -0.0009
dipole: 6.6640
quadrupole: -62.3213 -48.0160 -63.6196
quadrupole: -4.4734 -0.0001 0.0011
quadrupole: -4.3357 9.9696 -5.6339 -4.4734 -0.0001 0.0011
hfenergy: -743.1540046 hartree
pointgroup: C01 [X(C5H8O2S1)]
dipole: 2.5607148 -0.5628282 0.000363 debye
dipolederiv: 1.3937465 -0.0894514 -0.0000033 -0.0899093 1.0203496 -0.0000205 0.0000184 -0.0000208 1.2664449 -0.6364591 0.0338378 -0.0351451 0.0405284 -0.4886371 0.0116913 -0.2316306 0.0597866 -0.6699287 -0.6365731 0.0338565 0.0351874 0.0405167 -0.488652 -0.0116724 0.2316718 -0.0597712 -0.6698714 -0.215077 -0.0242735 -0.000001 0.0052907 -0.116007 -0.0000174 -0.0000232 -0.0000534 -0.0105962 -0.1165393 0.0269521 0.0000066 -0.031076 -0.144115 -0.0000052 0.0000039 0.0000405 0.021391 0.2006288 0.0409846 -0.0000352 -0.1674168 0.1563728 -0.0000066 -0.0000616 0.000019 -0.1075543 0.0124201 -0.0194134 -0.0000151 0.0758361 -0.1665994 0.0000481 -0.0000318 0.0000212 -0.2494871 -0.1039443 -0.0426403 0.0000107 0.0350935 0.0382309 0.0000133 0.0000338 0.0000102 0.0896187 0.0308394 -0.0175362 -0.0185358 -0.0130488 0.0289292 -0.0516642 0.0236805 -0.0754915 0.0242844 0.0308508 -0.0175605 0.0185296 -0.0130634 0.0288763 0.0516631 -0.0236884 0.0754991 0.0243312 0.0175297 -0.014687 -0.0231657 0.0052132 0.0323429 -0.0505209 -0.0665622 -0.0541502 0.0249938 0.0175125 -0.0146825 0.0231658 0.005223 0.0323595 0.0505261 0.0665584 0.0541503 0.0249785 -0.0573907 0.1257995 0.0000148 0.0595052 0.0521418 -0.0000235 0.0000244 -0.0000378 0.1820771 -0.0493166 0.0402558 0.0000076 0.1488432 -0.0505648 -0.0000224 0.0000316 -0.0000172 0.1160636 0.0558829 -0.0307298 0.0036129 -0.0507707 0.0325033 -0.1083594 -0.0585086 -0.1161539 -0.0333865 0.0558894 -0.0307118 -0.0036341 -0.050765 0.0324692 0.1083706 0.0584836 0.1161691 -0.0333588 unknown
polarizability: 95.7780503|2.6933281|82.4951703|-0.0011575|0.0010116|68.1279998 unknown
InChI: InChI=1S/C5H8O2S/c1-5-2-3-8(6,7)4-5/h2H,3-4H2,1H3
charge 0 multiplicity 1
16 atoms
S  -1.334834 0.181257 -0.000003
O  -2.106167 0.409554 -1.419152
O  -2.10672 0.409488 1.418856
C  0.356869 1.168608 0.000304
C  -0.435065 -1.563737 0.000091
C  1.421943 0.100161 0.000135
C  1.022066 -1.20294 0.000037
C  2.865531 0.550157 0.000045
H  0.3274 1.788607 0.911263
H  0.327506 1.789004 -0.910389
H  -0.79497 -2.069654 -0.910597
H  -0.794935 -2.06953 0.910863
H  1.755704 -2.018157 -0.000115
H  3.553072 -0.312409 -0.000079
H  3.090278 1.170081 0.888827
H  3.090122 1.17021 -0.888688
