program: Orca
programVersion: 5.0.2
elementType: N C C C C C C C C C C C C C C C C C C C H H H H H H H H H H H H H H H H H H H H H H H H H H H H H H H H
charge: 1
multiplicity: 1
keywords: wb97x-d3
keywords: def2-TZVPP
keywords: def2/J RIJCOSX
keywords: DEFGRID2
keywords: scfconv7
keywords: smallprint printgap noloewdin
keywords: NOSOSCF
formula: C19H32N
InChI: InChI=1/C14H21.C5H11N/c1-5-6-7-12-8-10-13(11-9-12)14(2,3)4;1-2-4-6-5-3-1/h6,8-11H,5,7H2,1-4H3;6H,1-5H2
52 atoms
N  2.792796 3.214141 1.212615
C  -4.748385 -3.251751 -0.231013
C  -4.253828 -1.934151 -0.285977
C  1.374353 3.1131 0.890622
C  3.355763 4.466987 0.723621
C  1.049939 3.321234 -0.584002
C  3.114797 4.722079 -0.759514
C  1.627154 4.640955 -1.083463
C  -3.655542 -1.228906 0.863285
C  -6.112896 -2.451609 0.030332
C  -2.174833 -1.323161 0.549308
C  2.061856 -1.644668 -0.356593
C  0.575933 -1.505782 -0.04816
C  -1.506895 -0.261548 -0.045804
C  -1.464972 -2.490306 0.823154
C  -0.150697 -0.351257 -0.331042
C  -0.115165 -2.574101 0.531512
C  2.660135 -0.356685 -0.9184
C  2.250386 -2.758993 -1.393403
C  2.821493 -2.007851 0.925294
H  -4.493924 -3.846215 0.637917
H  -4.802095 -3.801571 -1.16109
H  -4.255849 -1.423389 -1.244393
H  0.838434 3.860952 1.484211
H  1.008574 2.139229 1.223162
H  4.425206 4.477728 0.941302
H  2.916663 5.284933 1.303915
H  1.473746 2.495452 -1.166369
H  -0.032686 3.287614 -0.733669
H  3.520898 5.697697 -1.039114
H  3.659096 3.974044 -1.346747
H  1.459299 4.752839 -2.157047
H  1.104768 5.472597 -0.598066
H  -3.897341 -1.720765 1.805046
H  -3.971596 -0.18777 0.893201
H  -6.827756 -2.84146 -0.688252
H  -6.119982 -1.364297 -0.1537
H  -6.391209 -2.586375 1.068787
H  -2.042603 0.651552 -0.276004
H  -1.968566 -3.335981 1.276521
H  0.331799 0.505884 -0.779948
H  0.405152 -3.495049 0.763413
H  3.722922 -0.50329 -1.117289
H  2.192333 -0.058073 -1.858118
H  2.572394 0.475615 -0.217263
H  1.723734 -2.528037 -2.321308
H  3.309111 -2.878523 -1.632634
H  1.88462 -3.721029 -1.031977
H  3.88817 -2.106779 0.714498
H  2.704086 -1.235925 1.688125
H  2.485387 -2.953699 1.351687
H  3.269171 2.457416 0.731377
elementType: N C H
totalener: -797.91124197 hartree
nucrepener: 1542.81815169 hartree
electener: -2340.72939366 hartree
oneelecener: -4122.62791176 hartree
twoeener: 1781.89851810 hartree
cpcmener: -0.11214928 hartree
kineticenergy: 793.82943905 hartree
xcener: -82.801104386027 hartree
chargesum: 1.0000000
charge: -0.321627 0.001288 0.090288 -0.084977 -0.074741 -0.163708 -0.125782 -0.124219 -0.004894 -0.164585 -0.050106 0.327684 -0.056566 -0.159076 -0.185494 -0.211621 -0.182101 -0.354684 -0.332113 -0.328337 0.117373 0.125367 0.201356 0.089959 0.090948 0.087789 0.076881 0.072037 0.079598 0.069082 0.060257 0.072046 0.071657 0.124441 0.123157 0.141484 0.146355 0.126575 0.145790 0.154061 0.163116 0.146288 0.106411 0.107318 0.075752 0.103139 0.098472 0.097797 0.097712 0.102363 0.098753 0.132036
qa: -0.3216 0.0013 0.0903 -0.0850 -0.0747 -0.1637 -0.1258 -0.1242 -0.0049 -0.1646 -0.0501 0.3277 -0.0566 -0.1591 -0.1855 -0.2116 -0.1821 -0.3547 -0.3321 -0.3283 0.1174 0.1254 0.2014 0.0900 0.0909 0.0878 0.0769 0.0720 0.0796 0.0691 0.0603 0.0720 0.0717 0.1244 0.1232 0.1415 0.1464 0.1266 0.1458 0.1541 0.1631 0.1463 0.1064 0.1073 0.0758 0.1031 0.0985 0.0978 0.0977 0.1024 0.0988 0.1320
va: 2.9302 3.9162 3.6911 3.9310 3.9631 3.8509 3.8268 3.8921 3.8343 3.9516 3.7593 3.6127 3.6958 4.0154 3.9902 3.8924 4.0001 3.9292 3.9171 3.9171 1.0168 1.0128 0.9806 1.0070 1.0040 1.0047 1.0024 1.0106 1.0170 1.0167 1.0159 1.0154 1.0102 1.0135 1.0163 1.0039 0.9974 1.0101 1.0045 0.9973 0.9868 1.0009 1.0109 0.9975 1.0095 1.0032 1.0034 1.0038 1.0038 1.0027 1.0044 1.0278
dispersion: -0.023014724 hartree
energy: -797.934256690824 hartree
dipole: 3.44844 -11.94956 -8.50112 4.28032 -8.34728 -4.06695 -3.94478 2.99658 -0.94820
magnitude: 9.47144 au
magnitude: 24.07450 debye
