program: Orca
programVersion: 5.0.2
elementType: Cl O N N N C C C C C C C C C C C C C C C C C H H H H H H H H H H H H H H H H H H H H H H H
charge: 1
multiplicity: 1
keywords: wb97x-d3
keywords: def2-TZVPP
keywords: def2/J RIJCOSX
keywords: DEFGRID2
keywords: scfconv7
keywords: smallprint printgap noloewdin
keywords: NOSOSCF
formula: C17H23ClN3O
InChI: InChI=1/C17H23ClN3O/c1-16(2)8-7-14(9-13-3-5-15(18)6-4-13)17(16,22)10-21-12-19-11-20-21/h3-6,11-12,14,20,22H,7-10H2,1-2H3
45 atoms
Cl 4.888352 2.981214 1.524518
O  -2.196638 -0.945785 -1.941876
N  -1.083687 -2.802071 -0.121059
N  -0.574318 -3.0673 -1.327334
N  0.718651 -4.01049 0.141593
C  -2.243997 -0.653011 -0.558977
C  -3.494938 0.192043 -0.156348
C  -1.009156 0.142409 -0.001787
C  -3.023606 0.866551 1.133899
C  -1.590347 1.289671 0.839456
C  -2.309529 -2.039253 0.089744
C  -0.007214 0.610189 -1.061242
C  -4.772587 -0.616626 0.040581
C  -3.766453 1.25467 -1.227545
C  1.214719 1.215656 -0.429136
C  -0.280773 -3.39116 0.75026
C  2.210477 0.395825 0.099035
C  1.380032 2.593252 -0.331874
C  3.339332 0.926972 0.701507
C  2.501962 3.145489 0.270229
C  0.516183 -3.78933 -1.14574
C  3.476132 2.304387 0.780901
H  -0.458449 -0.515189 0.677998
H  -3.046546 0.151864 1.963383
H  -3.666494 1.701343 1.41978
H  -1.579465 2.225253 0.274621
H  -1.010415 1.46703 1.745294
H  -3.134141 -2.629946 -0.3100
H  -2.425726 -1.972048 1.169208
H  -0.475445 1.344843 -1.723247
H  0.304146 -0.230589 -1.685966
H  -5.606205 0.055113 0.253999
H  -5.039115 -1.182625 -0.854997
H  -4.710018 -1.314598 0.87729
H  -4.514444 1.958728 -0.859287
H  -2.885485 1.840292 -1.498466
H  -4.168855 0.816762 -2.142526
H  -2.043479 -0.142877 -2.452695
H  -0.459108 -3.350688 1.813391
H  2.110918 -0.682002 0.034857
H  0.626027 3.256301 -0.73829
H  4.10466 0.272873 1.097336
H  2.61221 4.219729 0.332904
H  1.130805 -4.132001 -1.962985
H  -0.98674 -2.656834 -2.163981
elementType: Cl O N C H
totalener: -1361.29569628 hartree
nucrepener: 2011.55719962 hartree
electener: -3372.85289590 hartree
oneelecener: -5832.28995117 hartree
twoeener: 2459.43705527 hartree
cpcmener: -0.10686450 hartree
kineticenergy: 1356.43300927 hartree
xcener: -110.340993105618 hartree
chargesum: 1.0000000
charge: -0.098968 -0.428427 0.082712 -0.034631 -0.360598 0.281384 0.273907 -0.064157 -0.228777 -0.199567 -0.142310 -0.088497 -0.343750 -0.389645 0.030232 0.164691 -0.223250 -0.214107 -0.161658 -0.151938 0.184290 0.095527 0.088283 0.086443 0.084716 0.088042 0.089300 0.159855 0.137889 0.104029 0.103824 0.106724 0.104531 0.093161 0.103343 0.108962 0.102488 0.240941 0.192504 0.142808 0.141450 0.141223 0.142455 0.202372 0.252194
qa: -0.0990 -0.4284 0.0827 -0.0346 -0.3606 0.2814 0.2739 -0.0642 -0.2288 -0.1996 -0.1423 -0.0885 -0.3437 -0.3896 0.0302 0.1647 -0.2233 -0.2141 -0.1617 -0.1519 0.1843 0.0955 0.0883 0.0864 0.0847 0.0880 0.0893 0.1599 0.1379 0.1040 0.1038 0.1067 0.1045 0.0932 0.1033 0.1090 0.1025 0.2409 0.1925 0.1428 0.1414 0.1412 0.1425 0.2024 0.2522
va: 1.2056 1.9873 3.4071 3.4547 3.0218 3.9349 3.7046 3.8068 4.0017 3.9657 3.8575 3.7422 3.9051 3.9460 3.5382 3.9839 3.9822 3.9811 4.0171 3.9968 3.9472 3.8318 1.0166 1.0094 1.0173 1.0034 1.0111 0.9898 0.9926 1.0108 1.0256 1.0026 1.0076 1.0007 1.0052 0.9977 1.0070 1.0021 0.9821 1.0037 1.0051 1.0074 1.0058 0.9741 0.9952
dispersion: -0.026366415 hartree
energy: -1361.322062694966 hartree
dipole: -39.42052 35.96652 -3.45400 -3.98539 -0.05476 -4.04015 -6.35893 4.65032 -1.70861
magnitude: 5.58321 au
magnitude: 14.19139 debye
