program: Orca
programVersion: 5.0.2
elementType: Cl O N N N C C C C C C C C C C C C C C C C C H H H H H H H H H H H H H H H H H H H H H H H
charge: 1
multiplicity: 1
keywords: wb97x-d3
keywords: def2-TZVPP
keywords: def2/J RIJCOSX
keywords: DEFGRID2
keywords: scfconv7
keywords: smallprint printgap noloewdin
keywords: NOSOSCF
formula: C17H23ClN3O
InChI: InChI=1/C17H23ClN3O/c1-16(2)8-7-14(9-13-3-5-15(18)6-4-13)17(16,22)10-21-12-19-11-20-21/h3-6,11-12,14,20,22H,7-10H2,1-2H3
45 atoms
Cl 4.856538 3.053651 1.528964
O  -2.203335 -0.930087 -1.938773
N  -1.100013 -2.809988 -0.15272
N  -0.630795 -3.092092 -1.371464
N  0.722932 -3.994828 0.066711
C  -2.250098 -0.649495 -0.553164
C  -3.498589 0.196066 -0.145111
C  -1.012264 0.135815 0.012624
C  -3.028758 0.856306 1.152949
C  -1.591438 1.273145 0.869176
C  -2.318268 -2.043296 0.082335
C  -0.012069 0.612989 -1.044885
C  -4.780048 -0.609339 0.039453
C  -3.762052 1.269823 -1.20743
C  1.203019 1.234213 -0.414327
C  -0.260976 -3.375399 0.699937
C  2.228063 0.430328 0.080377
C  1.333079 2.613719 -0.28667
C  3.350461 0.978271 0.68068
C  2.447673 3.182453 0.313398
C  0.47287 -3.799119 -1.215954
C  3.451053 2.356432 0.791361
H  -0.460803 -0.531097 0.682917
H  -3.061454 0.135779 1.976211
H  -3.666805 1.693332 1.441807
H  -1.572949 2.217296 0.319674
H  -1.014221 1.433086 1.779817
H  -3.151181 -2.625059 -0.313963
H  -2.422645 -1.987672 1.163765
H  -0.486498 1.341744 -1.709008
H  0.307506 -0.226586 -1.666854
H  -5.046161 -1.16431 -0.863086
H  -4.722861 -1.316757 0.868507
H  -5.611699 0.063387 0.257428
H  -2.879008 1.85826 -1.465425
H  -4.157269 0.841658 -2.130368
H  -4.513097 1.970044 -0.838144
H  -2.046963 -0.122976 -2.443619
H  -0.400391 -3.319036 1.768085
H  2.159571 -0.647734 -0.009885
H  0.556075 3.265368 -0.667673
H  4.139089 0.336395 1.050282
H  2.529916 4.25775 0.39936
H  1.062995 -4.148903 -2.048159
H  -1.069293 -2.688177 -2.197009
elementType: Cl O N C H
totalener: -1361.29568916 hartree
nucrepener: 2010.53453349 hartree
electener: -3371.83022265 hartree
oneelecener: -5830.29312424 hartree
twoeener: 2458.46290160 hartree
cpcmener: -0.10669953 hartree
kineticenergy: 1356.43198698 hartree
xcener: -110.340772798920 hartree
chargesum: 1.0000000
charge: -0.098922 -0.429304 0.083113 -0.033419 -0.360812 0.280426 0.273727 -0.058667 -0.228491 -0.201298 -0.144722 -0.089634 -0.343596 -0.390196 0.030419 0.163423 -0.220851 -0.217140 -0.160261 -0.153467 0.185176 0.094915 0.088269 0.086379 0.084559 0.088668 0.089796 0.160777 0.138366 0.104872 0.103258 0.104262 0.093082 0.106728 0.109351 0.102080 0.103340 0.240983 0.192973 0.141402 0.142419 0.141683 0.142609 0.202268 0.251456
qa: -0.0989 -0.4293 0.0831 -0.0334 -0.3608 0.2804 0.2737 -0.0587 -0.2285 -0.2013 -0.1447 -0.0896 -0.3436 -0.3902 0.0304 0.1634 -0.2209 -0.2171 -0.1603 -0.1535 0.1852 0.0949 0.0883 0.0864 0.0846 0.0887 0.0898 0.1608 0.1384 0.1049 0.1033 0.1043 0.0931 0.1067 0.1094 0.1021 0.1033 0.2410 0.1930 0.1414 0.1424 0.1417 0.1426 0.2023 0.2515
va: 1.2057 1.9854 3.4079 3.4572 3.0220 3.9358 3.7044 3.8007 4.0037 3.9665 3.8567 3.7415 3.9049 3.9463 3.5333 3.9837 3.9838 3.9815 4.0138 3.9982 3.9465 3.8329 1.0170 1.0095 1.0173 1.0032 1.0110 0.9895 0.9927 1.0102 1.0265 1.0077 1.0007 1.0026 0.9974 1.0072 1.0052 1.0024 0.9820 1.0049 1.0046 1.0071 1.0058 0.9741 0.9955
dispersion: -0.026323654 hartree
energy: -1361.322012810389 hartree
dipole: -39.29258 35.80351 -3.48907 -4.29063 0.17850 -4.11213 -6.21622 4.47391 -1.74231
magnitude: 5.66735 au
magnitude: 14.40527 debye
