program: Gaussian 09
title: 000070959
version: EM64L-G09RevD.01
frameworkgroup: C1[X(C6H2Cl3NO)]
method: RPBEPBE
basis: SDD
operation: Freq
keyword: #p
keyword: freq=noraman
keyword: PBEPBE/SDD
title: #p freq=noraman PBEPBE/SDD
converged: YES YES NO NO
title: Mulliken charges:
elementType: Cl Cl Cl O N C C C C C C H H
charge: 0.046040 0.032792 0.005769 -0.176036 0.036267 0.308431 -0.144487 -0.184050 -0.209538 -0.217897 -0.084355 0.292670 0.294395
chargesum: 0.00000
title: Mulliken charges with hydrogens summed into heavy atoms:
elementType: Cl Cl Cl O N C C C C C C
charge: 0.046040 0.032792 0.005769 -0.176036 0.036267 0.308431 -0.144487 -0.184050 0.083131 0.076498 -0.084355
polarizability: 1.66261059e+02 1.38389510e+00 1.31701142e+02 -9.76937051e-03 3.54176270e-04 3.74603527e+01
1716.lowfreq: -11.6489 -5.6565 -5.3685 -0.0022 -0.0019 0.0012 33.6140 52.4604 128.6323
frequency: 33.4033 52.4552 128.6319 174.3209 182.7480 192.6972 218.6681 286.0322 306.7302 347.3837 412.4852 420.0502 531.0100 551.8939 567.6754 691.1369 714.1979 764.0926 810.1978 861.1563 868.9508 1028.8149 1072.6649 1111.6550 1186.5132 1323.8072 1362.8200 1375.7551 1417.9698 1535.8778 1566.5127 3181.4252 3190.1496
redmass: 14.8490 19.5235 12.8872 23.2996 4.6536 23.6671 19.9905 8.0769 17.1974 32.8652 9.6949 8.2859 5.3119 5.3154 8.6408 10.0387 4.9389 11.6859 9.4284 1.4397 1.3629 5.1424 5.0032 2.4635 1.5934 3.6648 3.6191 7.2627 4.9404 9.5355 7.7634 1.0936 1.0941
irintensity: 0.1939 1.4668 0.7066 0.8715 0.0016 0.5577 0.2957 0.0035 3.1794 0.9160 12.7795 5.5697 0.0005 3.5075 2.4169 21.1574 13.1081 77.9908 140.5734 43.2873 0.2678 61.2298 160.9993 8.4678 33.7067 92.6919 32.1997 42.8835 126.4957 167.1987 228.2781 1.3171 1.6260
temp: 298.150 k
press: 1.00000 atm
elementType: 17 17 17 8 7 6 6 6 6 6 6 1 1
symmnumber: 1
zpe: 170287.7 jmol-1
zpe.correction: 0.064859 hartree
zpe.thermalcorrener: 0.075394 hartree
zpe.thermalcorrenthalpy: 0.076338 hartree
zpe.thermalcorrgfe: 0.026277 hartree
zpe.sumelectzpe: -1739.119740 hartree
zpe.sumelectthermal: -1739.109205 hartree
zpe.sumelectthermalent: -1739.108261 hartree
zpe.sumelectthermalfe: -1739.158322 hartree
dipole: 3.8163 -0.5285 -0.0007
dipole: 3.8527
quadrupole: -93.3055 -80.4882 -82.7021
quadrupole: 1.4375 0.0051 0.0071
quadrupole: -7.8069 5.0104 2.7965 1.4375 0.0051 0.0071
hfenergy: -1739.184599 hartree
pointgroup: C01 [X(C6H2Cl3N1O1)]
dipole: -1.5154328 -0.0321001 0.0020254 debye
dipolederiv: -0.0849898 0.252744 -0.0088825 0.1695065 -0.645737 0.0222851 -0.0060862 0.0222796 -0.0033458 -0.102598 -0.2940433 0.0100794 -0.1720621 -0.6862057 0.0232951 0.00588 0.0233043 -0.0095572 -0.919155 -0.0111175 0.0006794 -0.0276551 -0.1105771 0.0029766 0.0012179 0.0029887 -0.0253402 -0.9091837 -0.0081257 0.0008592 0.8373672 -0.2451724 0.0043075 -0.0270964 0.0047472 -0.0898616 1.7233685 0.0258413 -0.0022261 -0.4919814 0.1565419 -0.0096579 0.0158839 -0.0099807 -0.1625619 -1.3111054 0.0092266 0.0006603 -0.3591587 -0.5592098 0.0247537 0.0116417 0.0245277 0.163234 0.6008125 -0.5628405 0.0191816 0.13071 0.960677 -0.0337722 -0.0040751 -0.0332667 -0.0025388 0.6898871 0.5800979 -0.0200443 -0.0395885 1.129997 -0.0394988 0.0008552 -0.0399844 -0.0268534 -0.6861717 0.4451491 -0.0152101 0.2492684 -0.3440188 0.0089419 -0.0083655 0.0089545 -0.0808953 -0.6366006 -0.4554734 0.0159467 -0.2996697 -0.3859241 0.010581 0.0106602 0.0106802 -0.0802575 1.4882357 0.0173136 -0.0010608 0.0066786 0.6311718 -0.0228082 -0.0006522 -0.0229156 -0.0266034 0.0687009 -0.0228108 0.0008325 -0.0344766 0.0443276 0.0044074 0.0012288 0.0044621 0.1702724 0.0787995 0.0240385 -0.0008153 0.0310615 0.0541296 0.004189 -0.0010923 0.004203 0.1743087 unknown
polarizability: 165.4757334|-5.3317798|132.3736314|0.1199221|-3.2721059|37.5731887 unknown
InChI: InChI=1S/C6H2Cl3NO/c7-3-1-4(8)6(10-11)5(9)2-3/h1-2H
charge 0 multiplicity 1
13 atoms
Cl 1.020364 -2.742827 0.103542
Cl 0.871489 2.903183 -0.09131
Cl -3.768176 -0.064055 0.012156
O  3.0733 -0.699774 0.029481
N  2.322394 0.329592 -0.003258
C  0.866889 0.090732 0.005473
C  0.162901 -1.149946 0.048727
C  0.076098 1.279793 -0.035395
C  -1.241938 -1.210936 0.05142
C  -1.327795 1.256237 -0.034342
C  -1.963042 -0.000783 0.009485
H  -1.757783 -2.173706 0.085198
H  -1.904903 2.182688 -0.066576
