program: Orca
programVersion: 5.0.2
elementType: Cl O N N N C C C C C C C C C C C C C C C C C H H H H H H H H H H H H H H H H H H H H H H H
charge: 1
multiplicity: 1
keywords: wb97x-d3
keywords: def2-TZVPP
keywords: def2/J RIJCOSX
keywords: DEFGRID2
keywords: scfconv7
keywords: smallprint printgap noloewdin
keywords: NOSOSCF
formula: C17H23ClN3O
InChI: InChI=1/C17H23ClN3O/c1-16(2)8-7-14(9-13-3-5-15(18)6-4-13)17(16,22)10-21-12-19-11-20-21/h3-6,11-12,14,20,22H,7-10H2,1-2H3
45 atoms
Cl -4.649535 3.661067 -1.41765
O  2.10048 -0.837891 1.845351
N  1.151752 -2.96476 0.271289
N  0.802978 -3.21336 1.53652
N  -0.491512 -4.410832 0.260327
C  2.144532 -0.675877 0.436803
C  3.379945 0.181633 0.022327
C  0.948773 0.150459 -0.088883
C  2.89723 1.597264 0.379086
C  1.378014 1.614983 0.141941
C  2.2494 -2.089454 -0.12344
C  -0.423066 -0.173036 0.513573
C  3.658535 0.095875 -1.481968
C  4.65576 -0.188021 0.770436
C  -1.483145 0.780462 0.033933
C  0.354711 -3.707574 -0.477641
C  -2.029136 1.733518 0.887695
C  -1.936228 0.741671 -1.283297
C  -3.000095 2.624739 0.452179
C  -2.904273 1.623029 -1.739117
C  -0.194176 -4.076598 1.505052
C  -3.43064 2.559166 -0.861689
H  0.884724 -0.032555 -1.165006
H  3.424575 2.351143 -0.206907
H  3.119308 1.814068 1.427276
H  0.862184 2.038385 1.006509
H  1.101915 2.233604 -0.711441
H  3.178022 -2.566486 0.193973
H  2.225697 -2.08366 -1.209626
H  -0.378051 -0.129439 1.603457
H  -0.732258 -1.18529 0.243816
H  2.787317 0.327546 -2.096043
H  4.435854 0.815297 -1.743615
H  4.025485 -0.888023 -1.779729
H  5.46651 0.473705 0.45982
H  4.552544 -0.0866 1.850173
H  4.978713 -1.20902 0.555204
H  1.883267 -0.002152 2.275371
H  0.421825 -3.713539 -1.553786
H  -1.69645 1.783377 1.917234
H  -1.531693 0.008055 -1.970761
H  -3.413378 3.355968 1.133813
H  -3.245214 1.575838 -2.764578
H  -0.674767 -4.435693 2.400379
H  1.227697 -2.695313 2.303266
elementType: Cl O N C H
totalener: -1361.29053651 hartree
nucrepener: 2001.72342357 hartree
electener: -3363.01396008 hartree
oneelecener: -5812.71070052 hartree
twoeener: 2449.69674044 hartree
cpcmener: -0.12039561 hartree
kineticenergy: 1356.44761077 hartree
xcener: -110.344719967127 hartree
chargesum: 1.0000000
charge: -0.106124 -0.459598 0.059250 -0.016331 -0.367014 0.334931 0.225876 -0.026891 -0.226243 -0.238977 -0.119076 -0.079743 -0.368902 -0.344402 0.004994 0.169336 -0.197722 -0.206279 -0.172882 -0.175565 0.191025 0.110821 0.100004 0.082558 0.092454 0.097685 0.094883 0.165721 0.127704 0.098184 0.095607 0.110437 0.100202 0.097389 0.106982 0.087906 0.095677 0.236627 0.190996 0.142249 0.144067 0.143814 0.143839 0.202757 0.251775
qa: -0.1061 -0.4596 0.0593 -0.0163 -0.3670 0.3349 0.2259 -0.0269 -0.2262 -0.2390 -0.1191 -0.0797 -0.3689 -0.3444 0.0050 0.1693 -0.1977 -0.2063 -0.1729 -0.1756 0.1910 0.1108 0.1000 0.0826 0.0925 0.0977 0.0949 0.1657 0.1277 0.0982 0.0956 0.1104 0.1002 0.0974 0.1070 0.0879 0.0957 0.2366 0.1910 0.1422 0.1441 0.1438 0.1438 0.2028 0.2518
va: 1.1985 1.9779 3.4367 3.4536 3.0335 3.9079 3.7605 3.8063 3.9708 3.9315 3.8605 3.7739 3.9574 3.9320 3.5778 3.9870 3.9571 3.9654 4.0088 4.0087 3.9516 3.8013 1.0134 1.0142 1.0095 1.0059 1.0064 0.9873 0.9939 1.0232 1.0115 0.9987 1.0046 0.9978 0.9994 1.0195 1.0025 1.0068 0.9834 1.0051 1.0041 1.0058 1.0062 0.9744 0.9934
dispersion: -0.026033594 hartree
energy: -1361.316570105372 hartree
dipole: 37.29524 -33.71222 3.58302 -7.05454 2.50627 -4.54826 4.01078 -2.26950 1.74128
magnitude: 6.04622 au
magnitude: 15.36828 debye
