program: Orca
programVersion: 5.0.2
elementType: Cl O N N N C C C C C C C C C C C C C C C C C H H H H H H H H H H H H H H H H H H H H H H H
charge: 1
multiplicity: 1
keywords: wb97x-d3
keywords: def2-TZVPP
keywords: def2/J RIJCOSX
keywords: DEFGRID2
keywords: scfconv7
keywords: smallprint printgap noloewdin
keywords: NOSOSCF
formula: C17H23ClN3O
InChI: InChI=1/C17H23ClN3O/c1-16(2)8-7-14(9-13-3-5-15(18)6-4-13)17(16,22)10-21-12-19-11-20-21/h3-6,11-12,14,20,22H,7-10H2,1-2H3
45 atoms
Cl -4.994043 0.411725 0.113985
O  1.451959 0.510136 1.38547
N  0.268395 -1.73923 0.204042
N  -0.615968 -1.30352 1.106037
N  -1.673031 -2.653268 -0.236092
C  2.125365 -0.04597 0.273184
C  3.684209 0.056426 0.442007
C  1.802788 0.693523 -1.072989
C  3.986973 1.373421 -0.274866
C  3.144629 1.298944 -1.538207
C  1.707043 -1.511944 0.274655
C  0.760531 1.818309 -0.974154
C  4.422433 -1.084249 -0.271286
C  4.130034 0.068036 1.899341
C  -0.657771 1.429945 -0.666876
C  -0.40279 -2.554631 -0.593659
C  -1.317285 1.917538 0.458592
C  -1.374831 0.621873 -1.546914
C  -2.64858 1.61581 0.706788
C  -2.706597 0.310441 -1.318989
C  -1.779123 -1.851595 0.81221
C  -3.333555 0.812593 -0.189344
H  1.444641 -0.033331 -1.80766
H  5.05361 1.503114 -0.467612
H  3.667205 2.220057 0.342938
H  3.005272 2.273477 -2.008362
H  3.623849 0.66035 -2.281439
H  2.070627 -2.016178 1.172093
H  2.107565 -2.032076 -0.590349
H  0.759393 2.310325 -1.950385
H  1.095063 2.585077 -0.269873
H  4.108102 -1.228778 -1.305721
H  5.49108 -0.86392 -0.286665
H  4.302089 -2.037537 0.24608
H  3.755802 0.932036 2.448265
H  3.817058 -0.833155 2.431144
H  5.219955 0.106389 1.946929
H  1.64681 1.451137 1.460077
H  0.072246 -3.072708 -1.411496
H  -0.787908 2.554414 1.156735
H  -0.893108 0.232499 -2.436201
H  -3.140313 2.004777 1.588252
H  -3.246042 -0.316144 -2.016217
H  -2.668321 -1.662049 1.391056
H  -0.363854 -0.593622 1.789358
elementType: Cl O N C H
totalener: -1361.28728057 hartree
nucrepener: 2116.22064906 hartree
electener: -3477.50792962 hartree
oneelecener: -6040.50919313 hartree
twoeener: 2563.00126350 hartree
cpcmener: -0.11264605 hartree
kineticenergy: 1356.45546455 hartree
xcener: -110.349584071744 hartree
chargesum: 1.0000000
charge: -0.105747 -0.446798 0.074321 0.002528 -0.362904 0.300153 0.258827 -0.008310 -0.248412 -0.161888 -0.157437 -0.112806 -0.385059 -0.340457 0.036676 0.164050 -0.222395 -0.244572 -0.115786 -0.144707 0.162134 0.074355 0.082738 0.082254 0.087932 0.076156 0.097154 0.165736 0.131042 0.104867 0.106576 0.108390 0.101652 0.104376 0.089244 0.099600 0.103365 0.230525 0.189503 0.139472 0.146008 0.141573 0.140064 0.203329 0.252677
qa: -0.1057 -0.4468 0.0743 0.0025 -0.3629 0.3002 0.2588 -0.0083 -0.2484 -0.1619 -0.1574 -0.1128 -0.3851 -0.3405 0.0367 0.1640 -0.2224 -0.2446 -0.1158 -0.1447 0.1621 0.0744 0.0827 0.0823 0.0879 0.0762 0.0972 0.1657 0.1310 0.1049 0.1066 0.1084 0.1017 0.1044 0.0892 0.0996 0.1034 0.2305 0.1895 0.1395 0.1460 0.1416 0.1401 0.2033 0.2527
va: 1.1977 1.9806 3.4227 3.4558 3.0163 3.8796 3.7207 3.8151 3.9764 3.9172 3.8900 3.7877 3.9461 3.9494 3.4871 4.0047 3.9444 3.9017 3.9637 3.9066 3.9721 3.7508 1.0122 1.0196 1.0104 1.0165 0.9996 0.9854 0.9888 1.0040 1.0064 0.9955 1.0054 0.9973 1.0100 1.0041 1.0007 1.0128 0.9854 1.0063 1.0044 1.0069 1.0120 0.9734 0.9897
dispersion: -0.030438801 hartree
energy: -1361.317719366119 hartree
dipole: 44.56307 -41.89964 2.66344 2.88019 -4.22914 -1.34895 -0.76698 1.54385 0.77687
magnitude: 3.08498 au
magnitude: 7.84139 debye
