program: Orca
programVersion: 5.0.2
elementType: Cl O N N N C C C C C C C C C C C C C C C C C H H H H H H H H H H H H H H H H H H H H H H H
charge: 1
multiplicity: 1
keywords: wb97x-d3
keywords: def2-TZVPP
keywords: def2/J RIJCOSX
keywords: DEFGRID2
keywords: scfconv7
keywords: smallprint printgap noloewdin
keywords: NOSOSCF
formula: C17H23ClN3O
InChI: InChI=1/C17H23ClN3O/c1-16(2)8-7-14(9-13-3-5-15(18)6-4-13)17(16,22)10-21-12-19-11-20-21/h3-6,11-12,14,19,22H,7-10H2,1-2H3
45 atoms
Cl -4.702864 4.485648 -1.476898
O  1.39148 -0.932987 1.810033
N  1.447899 -3.3872 0.470445
N  2.176951 -4.121324 -0.389629
N  2.449944 -4.826474 1.649813
C  1.280197 -0.896422 0.401083
C  2.639153 -0.525091 -0.26704
C  0.32446 0.227882 -0.075009
C  2.659364 0.999126 -0.062731
C  1.215852 1.473254 -0.267149
C  0.667847 -2.242801 0.020544
C  -0.869895 0.463968 0.851471
C  2.630529 -0.826348 -1.767808
C  3.869057 -1.171486 0.363642
C  -1.829919 1.468279 0.277673
C  1.605211 -3.804853 1.705821
C  -2.658241 1.131677 -0.791649
C  -1.909053 2.760996 0.786382
C  -3.54099 2.050111 -1.337681
C  -2.785537 3.696748 0.254012
C  2.783935 -4.994429 0.34824
C  -3.596803 3.329724 -0.805955
H  -0.07111 -0.0750 -1.049416
H  3.365189 1.479054 -0.742712
H  3.00361 1.241728 0.947992
H  0.958867 2.261536 0.442437
H  1.071905 1.895036 -1.261823
H  0.556842 -2.341463 -1.055005
H  -0.324314 -2.338972 0.462317
H  -0.523715 0.817383 1.824401
H  -1.401907 -0.475857 1.024116
H  1.775675 -0.390118 -2.286988
H  3.530176 -0.411916 -2.22592
H  2.631317 -1.897106 -1.973991
H  3.927454 -2.245793 0.187074
H  4.768533 -0.735375 -0.075944
H  3.926885 -1.001993 1.438693
H  1.804331 -0.122452 2.129619
H  1.124751 -3.427074 2.591848
H  -2.62038 0.13149 -1.207119
H  -1.279794 3.048256 1.61992
H  -4.178663 1.768256 -2.164726
H  -2.832774 4.69537 0.667094
H  3.45777 -5.755474 -0.006987
H  2.768123 -5.377408 2.439129
elementType: Cl O N C H
totalener: -1361.30041974 hartree
nucrepener: 1969.59578614 hartree
electener: -3330.89620588 hartree
oneelecener: -5751.04219055 hartree
twoeener: 2420.14598466 hartree
cpcmener: -0.11846020 hartree
kineticenergy: 1356.45147278 hartree
xcener: -110.342311425292 hartree
chargesum: 1.0000000
charge: -0.107074 -0.465234 0.137745 -0.310666 -0.087918 0.403868 0.258481 -0.091966 -0.267633 -0.185662 -0.211282 -0.089251 -0.367168 -0.345380 0.015354 0.197417 -0.223057 -0.200916 -0.161825 -0.164875 0.156450 0.097636 0.098568 0.082788 0.091433 0.080511 0.099788 0.138630 0.163667 0.086540 0.104569 0.109738 0.100994 0.095369 0.097291 0.109374 0.092947 0.232779 0.207698 0.144783 0.143362 0.143383 0.143873 0.197988 0.246881
qa: -0.1071 -0.4652 0.1377 -0.3107 -0.0879 0.4039 0.2585 -0.0920 -0.2676 -0.1857 -0.2113 -0.0893 -0.3672 -0.3454 0.0154 0.1974 -0.2231 -0.2009 -0.1618 -0.1649 0.1564 0.0976 0.0986 0.0828 0.0914 0.0805 0.0998 0.1386 0.1637 0.0865 0.1046 0.1097 0.1010 0.0954 0.0973 0.1094 0.0929 0.2328 0.2077 0.1448 0.1434 0.1434 0.1439 0.1980 0.2469
va: 1.1974 1.9809 3.4224 2.8686 3.5593 3.8223 3.7353 3.9219 3.9975 3.8896 3.8685 3.7871 3.9474 3.9123 3.5419 3.9116 3.9853 3.9605 3.9913 3.9993 3.9254 3.8107 1.0123 1.0172 1.0074 1.0179 1.0024 1.0034 0.9933 1.0250 1.0155 0.9983 1.0060 1.0111 1.0057 1.0026 1.0189 1.0123 0.9880 1.0036 1.0045 1.0059 1.0055 0.9785 0.9652
dispersion: -0.025675268 hartree
energy: -1361.326095007540 hartree
dipole: 30.47784 -25.86150 4.61634 -14.76980 7.20417 -7.56564 3.75105 -0.56274 3.18831
magnitude: 9.41885 au
magnitude: 23.94082 debye
