program: Orca
programVersion: 5.0.2
elementType: Cl O N N N C C C C C C C C C C C C C C C C C H H H H H H H H H H H H H H H H H H H H H H H
charge: 1
multiplicity: 1
keywords: wb97x-d3
keywords: def2-TZVPP
keywords: def2/J RIJCOSX
keywords: DEFGRID2
keywords: scfconv7
keywords: smallprint printgap noloewdin
keywords: NOSOSCF
formula: C17H23ClN3O
InChI: InChI=1/C17H23ClN3O/c1-16(2)8-7-14(9-13-3-5-15(18)6-4-13)17(16,22)10-21-12-19-11-20-21/h3-6,11-12,14,20,22H,7-10H2,1-2H3
45 atoms
Cl -5.130737 -4.254523 -0.477804
O  1.337476 1.288512 1.980271
N  1.991602 3.164527 -0.003828
N  2.424481 3.629809 1.170575
N  3.444258 4.752273 -0.385134
C  1.26565 0.86252 0.62415
C  2.56243 0.109923 0.191898
C  0.114476 -0.192263 0.47346
C  2.273563 -1.299969 0.728871
C  0.817314 -1.559726 0.36757
C  0.952406 2.147871 -0.134233
C  -0.901819 0.031227 -0.656679
C  3.867092 0.657293 0.764424
C  2.689334 0.055952 -1.333424
C  -1.972002 -1.025725 -0.637237
C  2.619335 3.871733 -0.92981
C  -1.992861 -2.052853 -1.575206
C  -2.957734 -1.01581 0.347955
C  -2.958825 -3.048761 -1.535008
C  -3.930962 -2.000348 0.405535
C  3.308473 4.577032 0.918262
C  -3.920885 -3.014392 -0.540395
H  -0.448347 -0.141907 1.409556
H  2.419015 -1.33565 1.81433
H  2.955987 -2.040409 0.307197
H  0.750097 -1.944792 -0.652539
H  0.352911 -2.307358 1.010581
H  0.023894 2.589046 0.232568
H  0.842912 1.978269 -1.201676
H  -0.403291 0.019469 -1.628767
H  -1.377921 1.009604 -0.552843
H  3.848982 0.759468 1.849664
H  4.677906 -0.034844 0.527536
H  4.152849 1.618726 0.334738
H  1.782472 -0.281879 -1.835699
H  2.958194 1.024268 -1.759598
H  3.483819 -0.639913 -1.609052
H  1.609271 0.558601 2.549429
H  2.448044 3.71784 -1.983795
H  -1.244121 -2.082482 -2.357651
H  2.131314 3.180273 2.03746
H  -2.956515 -3.839243 -2.2737
H  -4.68816 -1.973938 1.177966
H  3.828139 5.109528 1.698595
H  -2.972367 -0.223982 1.088121
elementType: Cl O N C H
totalener: -1361.29327639 hartree
nucrepener: 1976.52912984 hartree
electener: -3337.82240623 hartree
oneelecener: -5762.81461226 hartree
twoeener: 2424.99220603 hartree
cpcmener: -0.10528375 hartree
kineticenergy: 1356.43094164 hartree
xcener: -110.341309052567 hartree
chargesum: 1.0000000
charge: -0.100319 -0.442639 0.086025 -0.035235 -0.356377 0.405725 0.238797 -0.098786 -0.242648 -0.177858 -0.196225 -0.089463 -0.351309 -0.386347 -0.010008 0.168434 -0.192797 -0.215848 -0.170249 -0.163513 0.191438 0.107126 0.085127 0.087305 0.085412 0.091083 0.093035 0.166219 0.143222 0.109335 0.105843 0.096866 0.113290 0.086568 0.114742 0.096921 0.107950 0.234557 0.193118 0.141192 0.251301 0.142109 0.142877 0.202465 0.141539
qa: -0.1003 -0.4426 0.0860 -0.0352 -0.3564 0.4057 0.2388 -0.0988 -0.2426 -0.1779 -0.1962 -0.0895 -0.3513 -0.3863 -0.0100 0.1684 -0.1928 -0.2158 -0.1702 -0.1635 0.1914 0.1071 0.0851 0.0873 0.0854 0.0911 0.0930 0.1662 0.1432 0.1093 0.1058 0.0969 0.1133 0.0866 0.1147 0.0969 0.1080 0.2346 0.1931 0.1412 0.2513 0.1421 0.1429 0.2025 0.1415
va: 1.2045 1.9942 3.4006 3.4544 3.0406 3.7699 3.7584 3.8599 3.9825 3.9055 3.8379 3.7494 3.9341 3.9493 3.5700 3.9843 3.9553 3.9831 4.0207 4.0047 3.9503 3.8283 1.0402 1.0124 1.0193 1.0055 1.0141 0.9995 0.9832 1.0014 1.0127 1.0150 1.0035 1.0013 1.0007 1.0019 1.0061 1.0116 0.9823 1.0056 0.9980 1.0069 1.0066 0.9744 1.0046
dispersion: -0.026223229 hartree
energy: -1361.319499616959 hartree
dipole: 29.88233 -25.57530 4.30703 10.12647 -5.18543 4.94104 1.12344 0.09685 1.22029
magnitude: 6.66734 au
magnitude: 16.94704 debye
