program: Orca
programVersion: 5.0.2
elementType: Cl O N N N C C C C C C C C C C C C C C C C C H H H H H H H H H H H H H H H H H H H H H H H
charge: 1
multiplicity: 1
keywords: wb97x-d3
keywords: def2-TZVPP
keywords: def2/J RIJCOSX
keywords: DEFGRID2
keywords: scfconv7
keywords: smallprint printgap noloewdin
keywords: NOSOSCF
formula: C17H23ClN3O
InChI: InChI=1/C17H23ClN3O/c1-16(2)8-7-14(9-13-3-5-15(18)6-4-13)17(16,22)10-21-12-19-11-20-21/h3-6,11-12,14,20,22H,7-10H2,1-2H3
45 atoms
Cl -5.099273 0.090018 0.517311
O  1.237848 -0.048144 1.671997
N  0.747464 1.582035 -0.523639
N  -0.20154 1.768797 0.398024
N  -0.813594 2.850356 -1.383935
C  2.044545 -0.313589 0.539603
C  3.512191 -0.695071 0.937605
C  1.592692 -1.535841 -0.3007
C  4.055329 -1.28903 -0.363336
C  2.872775 -2.016698 -1.017357
C  2.062823 1.008833 -0.234277
C  0.451463 -1.402172 -1.307768
C  3.492023 -1.771013 2.030584
C  4.361587 0.4644 1.448986
C  -0.922712 -1.040202 -0.809101
C  0.354297 2.265359 -1.589276
C  -1.409329 -1.429405 0.436844
C  -1.776362 -0.322669 -1.643943
C  -2.689062 -1.088617 0.849949
C  -3.059777 0.024955 -1.251759
C  -1.140395 2.518625 -0.144603
C  -3.50459 -0.355141 0.003303
H  1.302027 -2.306473 0.420175
H  4.907154 -1.945967 -0.180299
H  4.419628 -0.4911 -1.015816
H  2.824638 -1.793595 -2.085091
H  2.964217 -3.100155 -0.936183
H  2.552483 0.902534 -1.200256
H  2.59741 1.772548 0.329088
H  0.376938 -2.375548 -1.806171
H  0.736631 -0.709364 -2.104308
H  3.112956 -1.387328 2.979927
H  2.90992 -2.656215 1.769469
H  4.512241 -2.110856 2.214989
H  4.593109 1.200177 0.677433
H  3.883665 0.983469 2.283096
H  5.318744 0.086892 1.813259
H  1.037502 -0.870866 2.133733
H  0.946511 2.315589 -2.489485
H  -0.796769 -2.015882 1.109297
H  -0.13932 1.277955 1.290837
H  -3.043143 -1.396539 1.824871
H  -3.697645 0.58981 -1.918652
H  -2.039845 2.795777 0.381876
H  -1.434244 -0.023547 -2.62787
elementType: Cl O N C H
totalener: -1361.28962921 hartree
nucrepener: 2107.32028584 hartree
electener: -3468.60991505 hartree
oneelecener: -6022.79810637 hartree
twoeener: 2554.18819131 hartree
cpcmener: -0.09975976 hartree
kineticenergy: 1356.44425537 hartree
xcener: -110.351098196903 hartree
chargesum: 1.0000000
charge: -0.096779 -0.439574 0.088721 -0.011448 -0.354858 0.413740 0.241955 -0.027520 -0.249751 -0.195404 -0.218729 -0.166942 -0.372236 -0.355417 0.084125 0.147346 -0.266577 -0.248311 -0.123289 -0.136419 0.170317 0.083857 0.096327 0.086846 0.091899 0.083464 0.094620 0.140951 0.170985 0.117020 0.090515 0.098253 0.112037 0.101593 0.091583 0.103220 0.106847 0.239456 0.190407 0.134286 0.249820 0.142584 0.142751 0.203227 0.144503
qa: -0.0968 -0.4396 0.0887 -0.0114 -0.3549 0.4137 0.2420 -0.0275 -0.2498 -0.1954 -0.2187 -0.1669 -0.3722 -0.3554 0.0841 0.1473 -0.2666 -0.2483 -0.1233 -0.1364 0.1703 0.0839 0.0963 0.0868 0.0919 0.0835 0.0946 0.1410 0.1710 0.1170 0.0905 0.0983 0.1120 0.1016 0.0916 0.1032 0.1068 0.2395 0.1904 0.1343 0.2498 0.1426 0.1428 0.2032 0.1445
va: 1.2068 1.9876 3.4170 3.4423 3.0127 3.8021 3.7455 3.8591 3.9921 3.9031 3.9160 3.8456 3.9414 3.9156 3.4649 4.0005 3.9634 3.8994 3.9872 3.9484 3.9621 3.8086 1.0059 1.0152 1.0045 1.0090 1.0080 0.9874 0.9823 0.9938 1.0034 1.0089 0.9953 1.0054 0.9989 1.0104 1.0025 1.0054 0.9850 1.0154 1.0054 1.0058 1.0078 0.9736 1.0037
dispersion: -0.030024755 hartree
energy: -1361.319653964983 hartree
dipole: 42.54932 -39.62944 2.91988 -10.27912 11.26169 0.98257 2.14642 -2.06658 0.07983
magnitude: 3.08181 au
magnitude: 7.83333 debye
